%YAML 1.1
%TAG !u! tag:unity3d.com,2011:
--- !u!1045 &1
EditorBuildSettings:
  m_ObjectHideFlags: 0
  serializedVersion: 2
  m_Scenes:
  - enabled: 1
    path: Assets/Scenes/R1.2.1 Exteriors.unity
    guid: b3411e2ba9cc1364f85285ce4a641f32
  - enabled: 1
    path: Assets/Scenes/Test-R1.1.2.unity
    guid: a5363b7459542e34db1ee5c0d7ddf5a8
  m_configObjects:
    com.unity.input.settings: {fileID: 11400000, guid: b9daacfec6179664baae96f1991a7fbf, type: 2}
