{
  "project_info": {
    "project_number": "222391838833",
    "project_id": "android-birds",
    "storage_bucket": "android-birds.appspot.com"
  },
  "client": [
    {
      "client_info": {
        "mobilesdk_app_id": "1:222391838833:android:b4f46deff952d889f753d0",
        "android_client_info": {
          "package_name": "cat.itb.geobirdwatch"
        }
      },
      "oauth_client": [
        {
          "client_id": "222391838833-75hjk0prld8adoahdaglqffdv5ctc1iu.apps.googleusercontent.com",
          "client_type": 1,
          "android_info": {
            "package_name": "cat.itb.geobirdwatch",
            "certificate_hash": "f7e55eac7cadb055020e55e99519b6881edeb10f"
          }
        },
        {
          "client_id": "222391838833-c6s380g690sqa6ah4th52iangeci8g53.apps.googleusercontent.com",
          "client_type": 3
        }
      ],
      "api_key": [
        {
          "current_key": "AIzaSyAEbTJXhA_hDL6TkNyIq3o1LVej9xxbUSs"
        }
      ],
      "services": {
        "appinvite_service": {
          "other_platform_oauth_client": [
            {
              "client_id": "222391838833-c6s380g690sqa6ah4th52iangeci8g53.apps.googleusercontent.com",
              "client_type": 3
            }
          ]
        }
      }
    }
  ],
  "configuration_version": "1"
}