%YAML 1.1
%TAG !u! tag:unity3d.com,2011:
--- !u!114 &11400000
MonoBehaviour:
  m_ObjectHideFlags: 0
  m_CorrespondingSourceObject: {fileID: 0}
  m_PrefabInstance: {fileID: 0}
  m_PrefabAsset: {fileID: 0}
  m_GameObject: {fileID: 0}
  m_Enabled: 1
  m_EditorHideFlags: 0
  m_Script: {fileID: 11500000, guid: eb6a43c51fa0fbb4ba995c33790bf04a, type: 3}
  m_Name: DefaultPlayer
  m_EditorClassIdentifier: 
  Name: John
  currentHealth: 92
  maxHealth: 10
  speed: 10
  inventory: {fileID: 0}
  currentCoins: 0
  accumulatedCoins: 0
  currentPoints: 0
  accumulatedPoints: 0
