{
  "lerna": "3.20.2",
  "npmClient": "yarn",
  "useWorkspaces": true,
  "version": "2.3.1",
  "command": {
    "publish": {
      "allowBranch": "master",
      "message": "%s",
      "npmClient": "npm",
      "requireScripts": true
    }
  }
}
