{
    "region": "us-east-1",
    "application": "alfa",
    "environment": "alfa-prd",
    "profile": "personal-aws",
    "configuration": "Production",
    "health-check-url" : "/",
    "instance-type"    : "t2.micro"
}