<svg width="26" height="18" viewBox="0 0 26 18" fill="none" xmlns="http://www.w3.org/2000/svg">
<path d="M21.4212 3.59334L13.0016 11.0127L4.58015 3.59323C4.24483 3.29781 3.7337 3.33028 3.43839 3.66539C3.14318 4.0006 3.17532 4.51174 3.51065 4.80716L12.4669 12.6978C12.6198 12.8324 12.8108 12.8997 13.0017 12.8997C13.1926 12.8997 13.3837 12.8324 13.5366 12.6977L22.491 4.80705C22.8261 4.51174 22.8584 4.0005 22.5631 3.66528C22.2675 3.33039 21.7565 3.29803 21.4212 3.59334Z" fill="#354657"/>
<path d="M23.5732 0.15564H2.42677C1.0887 0.15564 0 1.24424 0 2.58241V15.4176C0 16.7557 1.0887 17.8443 2.42677 17.8443H23.5732C24.9113 17.8443 26 16.7557 26 15.4176V2.58241C26 1.24434 24.9113 0.15564 23.5732 0.15564ZM24.3822 15.4176C24.3822 15.8635 24.0193 16.2265 23.5732 16.2265H2.42677C1.98068 16.2265 1.61785 15.8635 1.61785 15.4176V2.58241C1.61785 2.13642 1.98068 1.77349 2.42677 1.77349H23.5732C24.0193 1.77349 24.3822 2.13642 24.3822 2.58241V15.4176Z" fill="#354657"/>
</svg>
