{
  "project_info": {
    "project_number": "106816622931",
    "project_id": "dreampet-d27f5",
    "storage_bucket": "dreampet-d27f5.appspot.com"
  },
  "client": [
    {
      "client_info": {
        "mobilesdk_app_id": "1:106816622931:android:30f2fc1d9781a9a1b911a6",
        "android_client_info": {
          "package_name": "aplicacionmascota.dreampet"
        }
      },
      "oauth_client": [
        {
          "client_id": "106816622931-9949eafdloeqci8bkids44e9msoapr81.apps.googleusercontent.com",
          "client_type": 3
        }
      ],
      "api_key": [
        {
          "current_key": "AIzaSyAEaaRR74tvUuh3RUD6Q70OYvFL63YM_-Q"
        }
      ],
      "services": {
        "appinvite_service": {
          "other_platform_oauth_client": [
            {
              "client_id": "106816622931-9949eafdloeqci8bkids44e9msoapr81.apps.googleusercontent.com",
              "client_type": 3
            }
          ]
        }
      }
    }
  ],
  "configuration_version": "1"
}