{
  "meta": {
    "theme": "@jsonresume/jsonresume-theme-class"
  },
  "basics": {
    "name": "@jsonresume/jsonresume-dev-environment",
    "label": "Engineer",
    "image": "https://openmoji.org/data/color/svg/1F916.svg",
    "email": "jsonresume-dev-environment@example.com",
    "phone": "(912) 555-4321",
    "url": "https://gitlab.com/alexlab-cloud/templates/jsonresume-dev-environment",
    "summary": "A summary of this person...",
    "location": {
      "address": "2712 Broadway St",
      "postalCode": "CA 94115",
      "city": "San Francisco",
      "countryCode": "US",
      "region": "California"
    },
    "profiles": [
      {
        "network": "Twitter",
        "username": "john",
        "url": "https://twitter.com/john"
      }
    ]
  },
  "work": [
    {
      "name": "Company",
      "position": "President",
      "url": "https://company.com",
      "startDate": "2013-01-01",
      "endDate": "2014-01-01",
      "summary": "Description…",
      "highlights": [
        "Started the company"
      ]
    }
  ],
  "volunteer": [
    {
      "organization": "Organization",
      "position": "Volunteer",
      "url": "https://organization.com/",
      "startDate": "2012-01-01",
      "endDate": "2013-01-01",
      "summary": "Description…",
      "highlights": [
        "Awarded 'Volunteer of the Month'"
      ]
    }
  ],
  "education": [
    {
      "institution": "University",
      "url": "https://institution.com/",
      "area": "Software Development",
      "studyType": "Bachelor",
      "startDate": "2011-01-01",
      "endDate": "2013-01-01",
      "score": "4.0",
      "courses": [
        "DB1101 - Basic SQL"
      ]
    }
  ],
  "awards": [
    {
      "title": "Award",
      "date": "2014-11-01",
      "awarder": "Company",
      "summary": "There is no spoon."
    }
  ],
  "certificates": [
    {
      "name": "Certificate",
      "date": "2021-11-07",
      "issuer": "Company",
      "url": "https://certificate.com"
    }
  ],
  "publications": [
    {
      "name": "Publication",
      "publisher": "Company",
      "releaseDate": "2014-10-01",
      "url": "https://publication.com",
      "summary": "Description…"
    }
  ],
  "skills": [
    {
      "name": "Web Development",
      "level": "Master",
      "keywords": [
        "HTML",
        "CSS",
        "JavaScript"
      ]
    }
  ],
  "languages": [
    {
      "language": "English",
      "fluency": "Native speaker"
    }
  ],
  "interests": [
    {
      "name": "Wildlife",
      "keywords": [
        "Ferrets",
        "Unicorns"
      ]
    }
  ],
  "references": [
    {
      "name": "Jane Doe",
      "reference": "Reference…"
    }
  ],
  "projects": [
    {
      "name": "Project",
      "startDate": "2019-01-01",
      "endDate": "2021-01-01",
      "description": "Description...",
      "highlights": [
        "Won award at AIHacks 2016"
      ],
      "url": "https://project.com/"
    }
  ]
}
