{
  "name": "ubuntu",
  // Or use a Dockerfile or Docker Compose file. More info: https://containers.dev/guide/dockerfile
  "image": "mcr.microsoft.com/devcontainers/base:jammy",
  "features": {
    "ghcr.io/devcontainers/features/common-utils:2": {
      "installZsh": true,
      "configureZshAsDefaultShell": true,
      "installOhMyZsh": true,
      "installOhMyZshConfig": true,
      "upgradePackages": true,
      "username": "vscode",
      "userUid": "automatic",
      "userGid": "automatic"
    }
  },

  // Editor customizations
  "customizations": {
    "vscode": {
      "extensions": [
        "mads-hartmann.bash-ide-vscode",
        "EditorConfig.EditorConfig",
        "esbenp.prettier-vscode",
        "ms-vscode.cpptools",
        "yzhang.markdown-all-in-one",
        "ms-vscode.cpptools-extension-pack"
      ]
    }
  },

  // Lifecycle scripts
  "postCreateCommand": "sudo chown -R vscode ${containerWorkspaceFolder}",
  "postAttachCommand": "make"
}
