{
  "image": "registry.gitlab.com/alexlab-cloud/dx/devcontainers/image-lib/flagship:0.1.0",
  "workspaceMount": "source=${localWorkspaceFolder},target=/home/alexlab-cloud/workspaces/jsonresume-kit,type=bind",
  "workspaceFolder": "/home/alexlab-cloud/workspaces/jsonresume-kit",
  "customizations": {
    "vscode": {
      "extensions": ["astro-build.astro-vscode", "bradlc.vscode-tailwindcss"]
    }
  }
}
