<?xml version="1.0" encoding="UTF-8" standalone="no"?>
<svg
   id="emoji"
   viewBox="0 0 72 72"
   version="1.1"
   sodipodi:docname="openmoji-design-style-2.svg"
   inkscape:version="1.1.2 (0a00cf5339, 2022-02-04)"
   xmlns:inkscape="http://www.inkscape.org/namespaces/inkscape"
   xmlns:sodipodi="http://sodipodi.sourceforge.net/DTD/sodipodi-0.dtd"
   xmlns="http://www.w3.org/2000/svg"
   xmlns:svg="http://www.w3.org/2000/svg">
  <defs
     id="defs21">
    <linearGradient
       id="linearGradient7079"
       inkscape:swatch="solid">
      <stop
         style="stop-color:#000000;stop-opacity:1;"
         offset="0"
         id="stop7077" />
    </linearGradient>
    <marker
       orient="auto"
       refY="0"
       refX="0"
       id="InfiniteLineEnd"
       inkscape:stockid="InfiniteLineEnd"
       style="overflow:visible"
       inkscape:isstock="true">
      <g
         style="fill:context-stroke"
         id="g1120">
        <circle
           cx="3"
           cy="0"
           r="0.8"
           id="circle1114" />
        <circle
           cx="6.5"
           cy="0"
           r="0.8"
           id="circle1116" />
        <circle
           cx="10"
           cy="0"
           r="0.8"
           id="circle1118" />
      </g>
    </marker>
  </defs>
  <sodipodi:namedview
     id="namedview19"
     pagecolor="#ffffff"
     bordercolor="#666666"
     borderopacity="1.0"
     inkscape:pageshadow="2"
     inkscape:pageopacity="0.0"
     inkscape:pagecheckerboard="0"
     showgrid="false"
     inkscape:zoom="22.627417"
     inkscape:cx="29.411223"
     inkscape:cy="40.901708"
     inkscape:window-width="2552"
     inkscape:window-height="1275"
     inkscape:window-x="0"
     inkscape:window-y="41"
     inkscape:window-maximized="1"
     inkscape:current-layer="layer5" />
  <g
     id="color" />
  <g
     id="hair" />
  <g
     id="skin" />
  <g
     id="skin-shadow" />
  <g
     id="line" />
  <g
     inkscape:groupmode="layer"
     id="layer4"
     inkscape:label="emoji">
    <g
       inkscape:groupmode="layer"
       id="layer7"
       inkscape:label="hair" />
    <g
       inkscape:groupmode="layer"
       id="layer6"
       inkscape:label="skin-shadow" />
    <g
       inkscape:groupmode="layer"
       id="layer5"
       inkscape:label="color"
       style="display:inline">
      <path
         style="fill:#1e50a0;stroke:#000000;stroke-width:0.0133173;stroke-linecap:round;stroke-linejoin:round;stroke-miterlimit:4;stroke-dasharray:none;stroke-opacity:1;paint-order:markers fill stroke"
         d="M 6.0066626,23.999975 V 18.006658 H 36.000002 65.993341 v 5.993317 5.993317 l -12.993803,-0.0021 -12.993804,-0.0021 -0.331052,-0.605476 c -0.619341,-1.132748 -1.668014,-2.430239 -2.714628,-3.358733 -4.025938,-3.571573 -9.878223,-4.365571 -14.702151,-1.994687 -1.486338,0.730511 -3.002099,1.88551 -4.081955,3.110418 -0.578768,0.656511 -1.660616,2.21277 -1.836114,2.641285 L 16.25321,29.99339 H 11.129936 6.0066585 Z"
         id="path5452" />
      <path
         style="fill:#1e50a0;stroke:#000000;stroke-width:0.0133173;stroke-linecap:round;stroke-linejoin:round;stroke-miterlimit:4;stroke-dasharray:none;stroke-opacity:1;paint-order:markers fill stroke"
         d="m 6.0066586,48.000072 v -5.993341 l 5.1147584,0.0027 5.114759,0.0027 0.379496,0.662383 c 2.031331,3.545541 5.681192,5.985345 9.770649,6.531336 0.868567,0.115964 2.516713,0.130793 3.325422,0.02992 3.944807,-0.492051 7.432885,-2.68564 9.602986,-6.039146 0.279546,-0.431988 0.545548,-0.876466 0.591116,-0.98773 l 0.08285,-0.202295 H 52.991016 65.993341 V 48 53.993342 H 36.000001 6.0066586 Z"
         id="path5885" />
      <rect
         style="fill:#ffffff;stroke:#000000;stroke-width:0;stroke-linecap:round;stroke-linejoin:round;stroke-miterlimit:4;stroke-dasharray:none;stroke-opacity:1;paint-order:markers fill stroke"
         id="rect4875"
         width="60"
         height="12"
         x="6.0000005"
         y="30"
         ry="0" />
      <circle
         style="display:inline;fill:#f1b31c;stroke:none;stroke-width:1.69432;stroke-linecap:round;stroke-linejoin:round;stroke-miterlimit:4;stroke-dasharray:none;paint-order:markers fill stroke"
         id="path3106"
         cx="28.132999"
         cy="36"
         r="4" />
      <path
         style="fill:#d22f27;stroke:#d22f27;stroke-width:0.3;stroke-linecap:round;stroke-linejoin:round;stroke-miterlimit:4;stroke-dasharray:none;stroke-opacity:1;paint-order:markers fill stroke"
         d="m 26.635542,47.191569 c -1.871822,-0.255524 -3.768088,-1.040625 -5.3274,-2.205676 -0.293759,-0.219485 -0.876298,-0.753988 -1.294531,-1.187786 -1.549453,-1.607118 -2.539712,-3.504933 -2.98017,-5.711449 -0.219263,-1.09842 -0.220494,-3.073005 -0.0026,-4.15398 0.825767,-4.096441 3.679472,-7.359666 7.558228,-8.642869 1.354091,-0.447972 1.911834,-0.531436 3.541092,-0.529909 1.257509,0.0012 1.549869,0.02163 2.143162,0.149933 2.936064,0.634936 5.40292,2.22241 7.046883,4.534818 0.457241,0.643157 0.931373,1.497955 0.864596,1.558751 -0.06359,0.0579 -4.754676,1.859341 -4.841324,1.859138 -0.02783,-6.5e-5 -0.138409,-0.139095 -0.245727,-0.308957 -0.265069,-0.419546 -1.041915,-1.1944 -1.525781,-1.521867 -1.213648,-0.821365 -2.690653,-1.188545 -4.108403,-1.02134 -2.604646,0.307182 -4.6638,2.162878 -5.23225,4.715269 -0.160807,0.722039 -0.145999,1.924194 0.0328,2.662793 0.15465,0.638842 0.530228,1.499947 0.874614,2.005272 0.31502,0.462236 1.022911,1.182378 1.493787,1.519641 1.721525,1.233032 4.10454,1.455553 6.012533,0.561438 1.014387,-0.475359 1.909702,-1.217855 2.449955,-2.03178 0.13092,-0.19724 0.256693,-0.358619 0.279493,-0.358619 0.04957,0 4.871857,1.793285 4.906678,1.824668 0.04096,0.03691 -0.454481,0.892408 -0.859861,1.484764 -1.528898,2.234082 -3.883878,3.879624 -6.500958,4.542546 -1.359603,0.344394 -2.94134,0.438602 -4.284828,0.255201 z"
         id="path6257" />
    </g>
    <g
       inkscape:groupmode="layer"
       id="layer1"
       inkscape:label="line"
       style="display:inline">
      <path
         style="fill:none;fill-opacity:1;stroke:#000000;stroke-width:2;stroke-linecap:round;stroke-linejoin:round;stroke-miterlimit:4;stroke-dasharray:none"
         d="M 27.558594,23.683594 A 12.331113,12.331113 0 0 0 25.857422,23.880859 12.331113,12.331113 0 0 0 15.802734,36.056641 12.331113,12.331113 0 0 0 25.970703,48.140625 12.331113,12.331113 0 0 0 39.685547,40.314453 L 32.808594,37.746094 A 5.0023942,5.0023942 0 0 1 28.132812,41.001953 5.0023942,5.0023942 0 0 1 23.130859,36 a 5.0023942,5.0023942 0 0 1 5.001953,-5.001953 5.0023942,5.0023942 0 0 1 4.669922,3.208984 l 6.841797,-2.626953 A 12.331113,12.331113 0 0 0 27.558594,23.683594 Z"
         id="path1114" />
      <g
         id="line-3"
         style="stroke-width:2;stroke-miterlimit:4;stroke-dasharray:none;paint-order:markers fill stroke">
        <rect
           x="5"
           y="17"
           width="62"
           height="38"
           fill="none"
           stroke="#000000"
           stroke-linecap="round"
           stroke-linejoin="round"
           stroke-width="2"
           id="rect11"
           style="stroke-width:2;stroke-miterlimit:4;stroke-dasharray:none;paint-order:markers fill stroke" />
      </g>
      <circle
         style="display:inline;fill:none;stroke:#000000;stroke-width:2.00193;stroke-linecap:round;stroke-linejoin:round;stroke-miterlimit:4;stroke-dasharray:none;stroke-opacity:1;paint-order:markers fill stroke"
         id="path3106-2"
         cx="28.1"
         cy="36"
         r="4.9990358" />
    </g>
    <g
       inkscape:groupmode="layer"
       id="layer2"
       inkscape:label="grid"
       sodipodi:insensitive="true"
       style="display:none">
      <g
         id="grid">
        <path
           d="M 68,4 V 68 H 4 V 4 H 68 M 72,0 H 0 v 72 h 72 z"
           fill="#b3b3b3"
           id="path2" />
        <path
           d="M 12.923,10.9583 H 59.0769 A 1.9231,1.9231 0 0 1 61,12.8814 v 46.1538 a 1.9231,1.9231 0 0 1 -1.9231,1.9231 H 12.9231 A 1.9231,1.9231 0 0 1 11,59.0352 V 12.8813 a 1.923,1.923 0 0 1 1.923,-1.923 z"
           fill="none"
           stroke="#00a5ff"
           stroke-miterlimit="10"
           stroke-width="0.1"
           id="path4" />
        <rect
           x="16"
           y="4"
           width="40"
           height="64"
           rx="2.2537"
           fill="none"
           stroke="#00a5ff"
           stroke-miterlimit="10"
           stroke-width="0.1"
           id="rect6" />
        <rect
           x="16"
           y="4"
           width="40"
           height="64"
           rx="2.2537"
           transform="rotate(90,36,36)"
           fill="none"
           stroke="#00a5ff"
           stroke-miterlimit="10"
           stroke-width="0.1"
           id="rect8" />
        <circle
           cx="36"
           cy="36"
           r="29"
           fill="none"
           stroke="#00a5ff"
           stroke-miterlimit="10"
           stroke-width="0.1"
           id="circle10" />
      </g>
    </g>
  </g>
</svg>
