[2021-05-19 18:40:03,509] {taskinstance.py:877} INFO - Dependencies all met for <TaskInstance: bike_analysis.download_from_s3 2021-05-19T18:38:00+00:00 [queued]>
[2021-05-19 18:40:03,558] {taskinstance.py:877} INFO - Dependencies all met for <TaskInstance: bike_analysis.download_from_s3 2021-05-19T18:38:00+00:00 [queued]>
[2021-05-19 18:40:03,559] {taskinstance.py:1068} INFO - 
--------------------------------------------------------------------------------
[2021-05-19 18:40:03,562] {taskinstance.py:1069} INFO - Starting attempt 1 of 1
[2021-05-19 18:40:03,563] {taskinstance.py:1070} INFO - 
--------------------------------------------------------------------------------
[2021-05-19 18:40:03,596] {taskinstance.py:1089} INFO - Executing <Task(PythonOperator): download_from_s3> on 2021-05-19T18:38:00+00:00
[2021-05-19 18:40:03,608] {standard_task_runner.py:52} INFO - Started process 135 to run task
[2021-05-19 18:40:03,615] {standard_task_runner.py:76} INFO - Running: ['airflow', 'tasks', 'run', 'bike_analysis', 'download_from_s3', '2021-05-19T18:38:00+00:00', '--job-id', '144', '--pool', 'default_pool', '--raw', '--subdir', 'DAGS_FOLDER/bike_analysis.py', '--cfg-path', '/tmp/tmpbyokaaf3', '--error-file', '/tmp/tmpcpflk5qc']
[2021-05-19 18:40:03,617] {standard_task_runner.py:77} INFO - Job 144: Subtask download_from_s3
[2021-05-19 18:40:03,744] {logging_mixin.py:104} INFO - Running <TaskInstance: bike_analysis.download_from_s3 2021-05-19T18:38:00+00:00 [running]> on host 4f3a9be9491d
[2021-05-19 18:40:03,849] {taskinstance.py:1283} INFO - Exporting the following env vars:
AIRFLOW_CTX_DAG_OWNER=airflow
AIRFLOW_CTX_DAG_ID=bike_analysis
AIRFLOW_CTX_TASK_ID=download_from_s3
AIRFLOW_CTX_EXECUTION_DATE=2021-05-19T18:38:00+00:00
AIRFLOW_CTX_DAG_RUN_ID=scheduled__2021-05-19T18:38:00+00:00
[2021-05-19 18:40:07,467] {python.py:118} INFO - Done. Returned value was: None
[2021-05-19 18:40:07,498] {taskinstance.py:1192} INFO - Marking task as SUCCESS. dag_id=bike_analysis, task_id=download_from_s3, execution_date=20210519T183800, start_date=20210519T184003, end_date=20210519T184007
[2021-05-19 18:40:07,684] {taskinstance.py:1246} INFO - 1 downstream tasks scheduled from follow-on schedule check
[2021-05-19 18:40:07,828] {local_task_job.py:146} INFO - Task exited with return code 0
