[2021-05-19 19:18:49,785] {taskinstance.py:877} INFO - Dependencies all met for <TaskInstance: taxi_analysis.upload_to_s3 2021-05-19T19:16:00+00:00 [queued]>
[2021-05-19 19:18:49,893] {taskinstance.py:877} INFO - Dependencies all met for <TaskInstance: taxi_analysis.upload_to_s3 2021-05-19T19:16:00+00:00 [queued]>
[2021-05-19 19:18:49,900] {taskinstance.py:1068} INFO - 
--------------------------------------------------------------------------------
[2021-05-19 19:18:49,904] {taskinstance.py:1069} INFO - Starting attempt 1 of 1
[2021-05-19 19:18:49,910] {taskinstance.py:1070} INFO - 
--------------------------------------------------------------------------------
[2021-05-19 19:18:49,937] {taskinstance.py:1089} INFO - Executing <Task(PythonOperator): upload_to_s3> on 2021-05-19T19:16:00+00:00
[2021-05-19 19:18:49,954] {standard_task_runner.py:52} INFO - Started process 691 to run task
[2021-05-19 19:18:49,980] {standard_task_runner.py:76} INFO - Running: ['airflow', 'tasks', 'run', 'taxi_analysis', 'upload_to_s3', '2021-05-19T19:16:00+00:00', '--job-id', '225', '--pool', 'default_pool', '--raw', '--subdir', 'DAGS_FOLDER/taxi_analysis.py', '--cfg-path', '/tmp/tmpy2kqaliy', '--error-file', '/tmp/tmp_wdo3wo5']
[2021-05-19 19:18:49,987] {standard_task_runner.py:77} INFO - Job 225: Subtask upload_to_s3
[2021-05-19 19:18:50,578] {logging_mixin.py:104} INFO - Running <TaskInstance: taxi_analysis.upload_to_s3 2021-05-19T19:16:00+00:00 [running]> on host 4f3a9be9491d
[2021-05-19 19:18:51,105] {taskinstance.py:1283} INFO - Exporting the following env vars:
AIRFLOW_CTX_DAG_OWNER=airflow
AIRFLOW_CTX_DAG_ID=taxi_analysis
AIRFLOW_CTX_TASK_ID=upload_to_s3
AIRFLOW_CTX_EXECUTION_DATE=2021-05-19T19:16:00+00:00
AIRFLOW_CTX_DAG_RUN_ID=scheduled__2021-05-19T19:16:00+00:00
[2021-05-19 19:18:53,029] {python.py:118} INFO - Done. Returned value was: None
[2021-05-19 19:18:53,062] {taskinstance.py:1192} INFO - Marking task as SUCCESS. dag_id=taxi_analysis, task_id=upload_to_s3, execution_date=20210519T191600, start_date=20210519T191849, end_date=20210519T191853
[2021-05-19 19:18:53,286] {taskinstance.py:1246} INFO - 0 downstream tasks scheduled from follow-on schedule check
[2021-05-19 19:18:53,491] {local_task_job.py:146} INFO - Task exited with return code 0
