﻿{
  "records": [
    {
      "AwsRegion": "",
      "Dynamodb": "",
      "EventID": "",
      "EventName": "",
      "EventSource": "",
      "EventSourceArn": "",
      "EventVersion": "",
      "UserIdentity": ""
    },
    {
      "AwsRegion": "",
      "Dynamodb": "",
      "EventID": "",
      "EventName": "",
      "EventSource": "",
      "EventSourceArn": "",
      "EventVersion": "",
      "UserIdentity": ""
    },
    {
      "AwsRegion": "",
      "Dynamodb": "",
      "EventID": "",
      "EventName": "",
      "EventSource": "",
      "EventSourceArn": "",
      "EventVersion": "",
      "UserIdentity": ""
    },
    {
      "AwsRegion": "",
      "Dynamodb": "",
      "EventID": "",
      "EventName": "",
      "EventSource": "",
      "EventSourceArn": "",
      "EventVersion": "",
      "UserIdentity": ""
    }
  ]
}