<svg width="16" height="16" viewBox="0 0 16 16" fill="none" xmlns="http://www.w3.org/2000/svg">
<path d="M8 16C3.58172 16 0 12.4183 0 8C0 3.58172 3.58172 0 8 0C12.4183 0 16 3.58172 16 8C16 12.4183 12.4183 16 8 16ZM8 15.2C11.9765 15.2 15.2 11.9765 15.2 8C15.2 4.02355 11.9765 0.8 8 0.8C4.02355 0.8 0.8 4.02355 0.8 8C0.8 11.9765 4.02355 15.2 8 15.2ZM11.0325 9.67451C11.2123 9.80291 11.2539 10.0527 11.1255 10.2325C10.9971 10.4123 10.7473 10.4539 10.5675 10.3255L7.7675 8.32549C7.69253 8.27194 7.63834 8.19414 7.61409 8.10525L6.41409 3.70525C6.35597 3.49212 6.48162 3.27222 6.69475 3.21409C6.90788 3.15597 7.12778 3.28162 7.18591 3.49475L8.34842 7.75731L11.0325 9.67451Z" fill="black" fill-opacity="0.4"/>
</svg>
