<?xml version="1.0" encoding="utf-8"?>
<!-- Generator: Adobe Illustrator 24.3.0, SVG Export Plug-In . SVG Version: 6.00 Build 0)  -->
<svg version="1.1" xmlns="http://www.w3.org/2000/svg" xmlns:xlink="http://www.w3.org/1999/xlink" x="0px" y="0px"
	 viewBox="0 0 359 359" style="enable-background:new 0 0 359 359;" xml:space="preserve">
<style type="text/css">

	#Bouche{
	  animation: smile_todok 1.8s ease-in-out forwards;
	  transform-origin: 43.5% 70%;
	  transform: scale(0.7,0.3);
	}



	@keyframes smile_todok {
	  0%   { 
	    transform-origin: 43.5% 70%;
	    transform: scale(0.7,0.3);
	  }
	  50%  { 

	    transform-origin: 43.5% 70%;
	    transform: scale(1,1);

	   }
	  100% { 
	    transform-origin: 43.5% 70%;
	    transform: scale(0.7,0.3);

	   }
	}
	.st0{fill:none;stroke:#009AFF;stroke-width:63.7795;stroke-linecap:round;stroke-linejoin:round;stroke-miterlimit:10;}
	.st1{fill:#008EDD;}
	.st2{opacity:0.8;fill:#FFFFFF;}
	.st3{clip-path:url(#SVGID_2_);}
	.st4{fill:#009AFF;}
	.st5{fill:#FFFFFF;}
	.st6{fill:#008DFF;}
	.st7{fill:#034883;}
	.st8{opacity:0.75;fill:#FFFFFF;}
	.st9{fill:none;stroke:#008EDD;stroke-miterlimit:10;}
</style>

<g id="all_todok">
	<g id="Typo">
	</g>
	<g id="Corp_Todok">
		<polyline class="st0" points="232.9,164.1 157,240 115.9,198.9 	"/>
		<circle class="st1" cx="115.9" cy="199.1" r="25.6"/>
	</g>
	<g id="Trou">
	</g>
	<g id="Bouche">
		<path class="st2" d="M139.5,235.4h36.7c2.4,0,5,0.2,5,5.1c0,12.8-10.4,23.3-23.3,23.3s-23.3-10.4-23.3-23.3
			C134.6,235.9,136.6,235.4,139.5,235.4z"/>
	</g>
	<g id="Ombre">
	</g>
	<g id="Eye_typo">
	</g>
	<g id="Masque_blanc">
	</g>
	<g id="Oeuil_gauche_Todok">
		<g>
			<defs>
				<circle id="SVGID_1_" cx="115.9" cy="199.1" r="25.6"/>
			</defs>
			<clipPath id="SVGID_2_">
				<use xlink:href="#SVGID_1_"  style="overflow:visible;"/>
			</clipPath>
			<g class="st3">
				<g>
					<circle class="st4" cx="115.9" cy="199.1" r="25.6"/>
					<circle class="st5" cx="115.9" cy="199.1" r="19.7"/>
				</g>
				<g>
					<circle class="st6" cx="115.9" cy="199.1" r="13.1"/>
					<g>
						<circle class="st7" cx="115.9" cy="199.1" r="7.7"/>
						<circle class="st8" cx="120.5" cy="198.2" r="2.6"/>
					</g>
				</g>
			</g>
		</g>
	</g>
	<g id="Oueil_en_bas">
	</g>
	<g id="Oeuil_droit_Todok">
		<g>
			<g>
				<circle class="st4" cx="232.9" cy="164.1" r="32.1"/>
				<circle class="st5" cx="232.9" cy="164.1" r="19.6"/>
			</g>
			<g>
				<circle class="st6" cx="232.9" cy="164.1" r="13"/>
				<g>
					<circle class="st7" cx="232.9" cy="164.1" r="7.7"/>
					<circle class="st8" cx="237.5" cy="163.2" r="2.6"/>
				</g>
			</g>
		</g>
	</g>
</g>


<line class="st9" x1="0" y1="271.3" x2="359" y2="271.3"/>


</svg>
