[
  {
    "idTittle": "USD",
    "tittle": "DOLAR",
    "classification": "DIV",
    "value": "500000000",
    "createdAt": "2022-03-14",
    "expiredDate": "2023-03-15",
    "feePayment": "y"
  },
  {
    "idTittle": "TRPV",
    "tittle": "TITULO DE PARTICIPACION RENTA VARIABLE",
    "classification": "DIV",
    "value": "256000000",
    "createdAt": "2022-08-25",
    "expiredDate": "2023-08-26",
    "feePayment": "y"
  },
  {
    "idTittle": "TP",
    "tittle": "TITULO DE PARTICIPACION",
    "classification": "DIV",
    "value": "360000000",
    "createdAt": "2022-02-16",
    "expiredDate": "2023-02-17",
    "feePayment": "y"
  }
]
