%YAML 1.1
%TAG !u! tag:unity3d.com,2011:
--- !u!1 &4284502164249906770
GameObject:
  m_ObjectHideFlags: 0
  m_CorrespondingSourceObject: {fileID: 0}
  m_PrefabInstance: {fileID: 0}
  m_PrefabAsset: {fileID: 0}
  serializedVersion: 6
  m_Component:
  - component: {fileID: 5505926691894575213}
  m_Layer: 0
  m_Name: Pivote Sword
  m_TagString: Untagged
  m_Icon: {fileID: 0}
  m_NavMeshLayer: 0
  m_StaticEditorFlags: 0
  m_IsActive: 1
--- !u!4 &5505926691894575213
Transform:
  m_ObjectHideFlags: 0
  m_CorrespondingSourceObject: {fileID: 0}
  m_PrefabInstance: {fileID: 0}
  m_PrefabAsset: {fileID: 0}
  m_GameObject: {fileID: 4284502164249906770}
  m_LocalRotation: {x: 0, y: 0, z: 0, w: 1}
  m_LocalPosition: {x: 0, y: 0, z: 0}
  m_LocalScale: {x: 1, y: 1, z: 1}
  m_Children:
  - {fileID: 4586541172697858956}
  m_Father: {fileID: 8674756286943964403}
  m_RootOrder: 0
  m_LocalEulerAnglesHint: {x: 0, y: 0, z: 0}
--- !u!1 &9183403874210150994
GameObject:
  m_ObjectHideFlags: 0
  m_CorrespondingSourceObject: {fileID: 0}
  m_PrefabInstance: {fileID: 0}
  m_PrefabAsset: {fileID: 0}
  serializedVersion: 6
  m_Component:
  - component: {fileID: 8674756286943964403}
  m_Layer: 0
  m_Name: Sword_14_Red
  m_TagString: Untagged
  m_Icon: {fileID: 0}
  m_NavMeshLayer: 0
  m_StaticEditorFlags: 0
  m_IsActive: 1
--- !u!4 &8674756286943964403
Transform:
  m_ObjectHideFlags: 0
  m_CorrespondingSourceObject: {fileID: 0}
  m_PrefabInstance: {fileID: 0}
  m_PrefabAsset: {fileID: 0}
  m_GameObject: {fileID: 9183403874210150994}
  m_LocalRotation: {x: 0, y: 0, z: 0, w: 1}
  m_LocalPosition: {x: 0.13608727, y: -0.7761202, z: -4.083394}
  m_LocalScale: {x: 1, y: 1, z: 1}
  m_Children:
  - {fileID: 5505926691894575213}
  m_Father: {fileID: 0}
  m_RootOrder: 0
  m_LocalEulerAnglesHint: {x: 0, y: 0, z: 0}
--- !u!1001 &1049400338646040686
PrefabInstance:
  m_ObjectHideFlags: 0
  serializedVersion: 2
  m_Modification:
    m_TransformParent: {fileID: 5505926691894575213}
    m_Modifications:
    - target: {fileID: 3546183286804972514, guid: f6c4ffb4d9b01e6438aee492ee60e489, type: 3}
      propertyPath: m_RootOrder
      value: 0
      objectReference: {fileID: 0}
    - target: {fileID: 3546183286804972514, guid: f6c4ffb4d9b01e6438aee492ee60e489, type: 3}
      propertyPath: m_LocalPosition.x
      value: -0.13608727
      objectReference: {fileID: 0}
    - target: {fileID: 3546183286804972514, guid: f6c4ffb4d9b01e6438aee492ee60e489, type: 3}
      propertyPath: m_LocalPosition.y
      value: 0.7761202
      objectReference: {fileID: 0}
    - target: {fileID: 3546183286804972514, guid: f6c4ffb4d9b01e6438aee492ee60e489, type: 3}
      propertyPath: m_LocalPosition.z
      value: 4.083394
      objectReference: {fileID: 0}
    - target: {fileID: 3546183286804972514, guid: f6c4ffb4d9b01e6438aee492ee60e489, type: 3}
      propertyPath: m_LocalRotation.w
      value: 1
      objectReference: {fileID: 0}
    - target: {fileID: 3546183286804972514, guid: f6c4ffb4d9b01e6438aee492ee60e489, type: 3}
      propertyPath: m_LocalRotation.x
      value: -0
      objectReference: {fileID: 0}
    - target: {fileID: 3546183286804972514, guid: f6c4ffb4d9b01e6438aee492ee60e489, type: 3}
      propertyPath: m_LocalRotation.y
      value: -0
      objectReference: {fileID: 0}
    - target: {fileID: 3546183286804972514, guid: f6c4ffb4d9b01e6438aee492ee60e489, type: 3}
      propertyPath: m_LocalRotation.z
      value: -0
      objectReference: {fileID: 0}
    - target: {fileID: 3546183286804972514, guid: f6c4ffb4d9b01e6438aee492ee60e489, type: 3}
      propertyPath: m_LocalEulerAnglesHint.x
      value: 0
      objectReference: {fileID: 0}
    - target: {fileID: 3546183286804972514, guid: f6c4ffb4d9b01e6438aee492ee60e489, type: 3}
      propertyPath: m_LocalEulerAnglesHint.y
      value: 0
      objectReference: {fileID: 0}
    - target: {fileID: 3546183286804972514, guid: f6c4ffb4d9b01e6438aee492ee60e489, type: 3}
      propertyPath: m_LocalEulerAnglesHint.z
      value: 0
      objectReference: {fileID: 0}
    - target: {fileID: 3975067126450634077, guid: f6c4ffb4d9b01e6438aee492ee60e489, type: 3}
      propertyPath: m_TagString
      value: Sword
      objectReference: {fileID: 0}
    - target: {fileID: 4214597693441333592, guid: f6c4ffb4d9b01e6438aee492ee60e489, type: 3}
      propertyPath: m_Name
      value: Sword14_Red
      objectReference: {fileID: 0}
    - target: {fileID: 7509106134200059745, guid: f6c4ffb4d9b01e6438aee492ee60e489, type: 3}
      propertyPath: m_Size.x
      value: 0.3620441
      objectReference: {fileID: 0}
    - target: {fileID: 7509106134200059745, guid: f6c4ffb4d9b01e6438aee492ee60e489, type: 3}
      propertyPath: m_Size.y
      value: 1.2916416
      objectReference: {fileID: 0}
    - target: {fileID: 7509106134200059745, guid: f6c4ffb4d9b01e6438aee492ee60e489, type: 3}
      propertyPath: m_Center.x
      value: -0.0000010053328
      objectReference: {fileID: 0}
    - target: {fileID: 7509106134200059745, guid: f6c4ffb4d9b01e6438aee492ee60e489, type: 3}
      propertyPath: m_Center.y
      value: 0.8476127
      objectReference: {fileID: 0}
    - target: {fileID: 7509106134200059745, guid: f6c4ffb4d9b01e6438aee492ee60e489, type: 3}
      propertyPath: m_Center.z
      value: 0.0024685054
      objectReference: {fileID: 0}
    - target: {fileID: 7509106134200059745, guid: f6c4ffb4d9b01e6438aee492ee60e489, type: 3}
      propertyPath: m_IsTrigger
      value: 1
      objectReference: {fileID: 0}
    m_RemovedComponents: []
  m_SourcePrefab: {fileID: 100100000, guid: f6c4ffb4d9b01e6438aee492ee60e489, type: 3}
--- !u!4 &4586541172697858956 stripped
Transform:
  m_CorrespondingSourceObject: {fileID: 3546183286804972514, guid: f6c4ffb4d9b01e6438aee492ee60e489, type: 3}
  m_PrefabInstance: {fileID: 1049400338646040686}
  m_PrefabAsset: {fileID: 0}
