%YAML 1.1
%TAG !u! tag:unity3d.com,2011:
--- !u!114 &11400000
MonoBehaviour:
  m_ObjectHideFlags: 0
  m_CorrespondingSourceObject: {fileID: 0}
  m_PrefabInstance: {fileID: 0}
  m_PrefabAsset: {fileID: 0}
  m_GameObject: {fileID: 0}
  m_Enabled: 1
  m_EditorHideFlags: 0
  m_Script: {fileID: 11500000, guid: b4695fb24646af9489aabd0434e409c0, type: 3}
  m_Name: Shield
  m_EditorClassIdentifier: 
  itemIcon: {fileID: 21300000, guid: 69f120b83d67f1d47aa37125bc809c44, type: 3}
  itemName: Shield
  modelPrefab: {fileID: 897403693152497712, guid: fdae5057e5d36af41b4f8f3a5cb46818, type: 3}
  isUnarmed: 0
  baseDamage: 25
  criticalDamageMultiplier: 4
  physicalDamageAbsorption: 99
  right_hand_idle: Right_Arm_Idle_1
  left_hand_idle: Left_Arm_Idle_1
  th_idle: TH_idle_01
  OH_Light_Attack_1: 
  OH_Light_Attack_2: 
  OH_Light_Attack_3: 
  OH_Heavy_Attack_1: 
  OH_Heavy_Attack_2: 
  th_light_attack_1: 
  th_light_attack_2: 
  weapon_art: Parry
  baseStamina: 0
  lightAttackMultiplier: 0
  heavyAttackMultiplier: 0
  isMeleeWeapon: 0
  isShieldWeapon: 1
