{
   "hash" : "0x0000000000000000000000000000000000000000000000000000000000000000",
   "validators" : [
	   {
		   "address": "0x42b9e4ffa28bc4bd9c8f7207f3a296ce960a365d",
		   "block": 10
	   }
   ],
   "timestamp" : 1600254946
}
