module gitlab.com/q-dev/q-client

go 1.19

require (
	github.com/Azure/azure-sdk-for-go/sdk/storage/azblob v0.3.0
	github.com/VictoriaMetrics/fastcache v1.6.0
	github.com/aws/aws-sdk-go-v2 v1.18.1
	github.com/aws/aws-sdk-go-v2/config v1.18.27
	github.com/aws/aws-sdk-go-v2/credentials v1.13.26
	github.com/aws/aws-sdk-go-v2/feature/s3/manager v1.11.70
	github.com/aws/aws-sdk-go-v2/service/route53 v1.1.1
	github.com/aws/aws-sdk-go-v2/service/s3 v1.35.0
	github.com/btcsuite/btcd/btcec/v2 v2.2.0
	github.com/cespare/cp v0.1.0
	github.com/cloudflare/cloudflare-go v0.14.0
	github.com/consensys/gnark-crypto v0.9.1-0.20230105202408-1a7a29904a7c
	github.com/davecgh/go-spew v1.1.1
	github.com/deckarep/golang-set v1.8.0
	github.com/docker/docker v1.6.2
	github.com/dop251/goja v0.0.0-20220405120441-9037c2b61cbf
	github.com/edsrzf/mmap-go v1.0.0
	github.com/fatih/color v1.13.0
	github.com/fjl/gencodec v0.0.0-20220412091415-8bb9e558978c
	github.com/fjl/memsize v0.0.0-20190710130421-bcb5799ab5e5
	github.com/gballet/go-libpcsclite v0.0.0-20190607065134-2772fd86a8ff
	github.com/getsentry/sentry-go v0.18.0
	github.com/go-stack/stack v1.8.1
	github.com/golang-jwt/jwt/v4 v4.3.0
	github.com/golang/protobuf v1.5.2
	github.com/golang/snappy v0.0.5-0.20220116011046-fa5810519dcb
	github.com/google/gofuzz v1.1.1-0.20200604201612-c04b05f3adfa
	github.com/google/uuid v1.3.0
	github.com/gorilla/websocket v1.4.2
	github.com/graph-gophers/graphql-go v1.3.0
	github.com/hashicorp/go-bexpr v0.1.10
	github.com/hashicorp/golang-lru v0.5.1
	github.com/holiman/bloomfilter/v2 v2.0.3
	github.com/holiman/uint256 v1.2.2-0.20230321075855-87b91420868c
	github.com/huin/goupnp v1.0.3
	github.com/influxdata/influxdb v1.8.9
	github.com/influxdata/influxdb-client-go/v2 v2.7.0
	github.com/jackpal/go-nat-pmp v1.0.2
	github.com/jedisct1/go-minisign v0.0.0-20190909160543-45766022959e
	github.com/julienschmidt/httprouter v1.3.0
	github.com/karalabe/usb v0.0.2
	github.com/mattn/go-colorable v0.1.13
	github.com/mattn/go-isatty v0.0.16
	github.com/naoina/toml v0.1.2-0.20170918210437-9fafd6967416
	github.com/olekukonko/tablewriter v0.0.5
	github.com/peterh/liner v1.1.1-0.20190123174540-a2c9a5303de7
	github.com/pkg/errors v0.9.1
	github.com/prometheus/tsdb v0.10.0
	github.com/rjeczalik/notify v0.9.3
	github.com/robfig/cron/v3 v3.0.1
	github.com/rs/cors v1.7.0
	github.com/shirou/gopsutil v3.21.4-0.20210419000835-c7a38de76ee5+incompatible
	github.com/status-im/keycard-go v0.2.0
	github.com/stretchr/testify v1.8.0
	github.com/supranational/blst v0.3.8-0.20220526154634-513d2456b344
	github.com/syndtr/goleveldb v1.0.1-0.20210819022825-2ae1ddf74ef7
	github.com/tyler-smith/go-bip39 v1.1.0
	github.com/urfave/cli/v2 v2.17.2-0.20221006022127-8f469abc00aa
	golang.org/x/crypto v0.1.0
	golang.org/x/exp v0.0.0-20220426173459-3bcf042a4bf5
	golang.org/x/mobile v0.0.0-20230301163155-e0f57694e12c
	golang.org/x/sync v0.1.0
	golang.org/x/sys v0.6.0
	golang.org/x/term v0.6.0
	golang.org/x/text v0.8.0
	golang.org/x/time v0.0.0-20220922220347-f3bd1da661af
	golang.org/x/tools v0.7.0
	gopkg.in/natefinch/npipe.v2 v2.0.0-20160621034901-c1b8fa8bdcce
)

require (
	github.com/aws/aws-sdk-go-v2/aws/protocol/eventstream v1.4.10 // indirect
	github.com/aws/aws-sdk-go-v2/internal/v4a v1.0.26 // indirect
	github.com/aws/aws-sdk-go-v2/service/internal/accept-encoding v1.9.11 // indirect
	github.com/aws/aws-sdk-go-v2/service/internal/checksum v1.1.29 // indirect
	github.com/aws/aws-sdk-go-v2/service/internal/s3shared v1.14.3 // indirect
	github.com/aws/aws-sdk-go-v2/service/ssooidc v1.14.12 // indirect
	github.com/go-kit/kit v0.10.0 // indirect
	github.com/go-logfmt/logfmt v0.5.1 // indirect
	github.com/jmespath/go-jmespath v0.4.0 // indirect
)

require (
	github.com/Azure/azure-sdk-for-go/sdk/azcore v0.21.1 // indirect
	github.com/Azure/azure-sdk-for-go/sdk/internal v0.8.3 // indirect
	github.com/StackExchange/wmi v0.0.0-20180116203802-5d049714c4a6 // indirect
	github.com/aws/aws-sdk-go-v2/feature/ec2/imds v1.13.4 // indirect
	github.com/aws/aws-sdk-go-v2/internal/configsources v1.1.34 // indirect
	github.com/aws/aws-sdk-go-v2/internal/endpoints/v2 v2.4.28 // indirect
	github.com/aws/aws-sdk-go-v2/internal/ini v1.3.35 // indirect
	github.com/aws/aws-sdk-go-v2/service/internal/presigned-url v1.9.28 // indirect
	github.com/aws/aws-sdk-go-v2/service/sso v1.12.12 // indirect
	github.com/aws/aws-sdk-go-v2/service/sts v1.19.2 // indirect
	github.com/aws/smithy-go v1.13.5 // indirect
	github.com/cespare/xxhash/v2 v2.2.0 // indirect
	github.com/consensys/bavard v0.1.13 // indirect
	github.com/cpuguy83/go-md2man/v2 v2.0.2 // indirect
	github.com/decred/dcrd/dcrec/secp256k1/v4 v4.0.1 // indirect
	github.com/deepmap/oapi-codegen v1.8.2 // indirect
	github.com/dlclark/regexp2 v1.7.0 // indirect
	github.com/fsnotify/fsnotify v1.6.0 // indirect
	github.com/garslo/gogen v0.0.0-20170306192744-1d203ffc1f61 // indirect
	github.com/go-ole/go-ole v1.2.1 // indirect
	github.com/go-sourcemap/sourcemap v2.1.3+incompatible // indirect
	github.com/influxdata/line-protocol v0.0.0-20210311194329-9aa0e372d097 // indirect
	github.com/kr/pretty v0.3.1 // indirect
	github.com/kylelemons/godebug v1.1.0 // indirect
	github.com/mattn/go-runewidth v0.0.9 // indirect
	github.com/mitchellh/mapstructure v1.4.1 // indirect
	github.com/mitchellh/pointerstructure v1.2.0 // indirect
	github.com/mmcloughlin/addchain v0.4.0 // indirect
	github.com/naoina/go-stringutil v0.1.0 // indirect
	github.com/opentracing/opentracing-go v1.2.0 // indirect
	github.com/pmezard/go-difflib v1.0.0 // indirect
	github.com/russross/blackfriday/v2 v2.1.0 // indirect
	github.com/tklauser/go-sysconf v0.3.5 // indirect
	github.com/tklauser/numcpus v0.2.2 // indirect
	github.com/xrash/smetrics v0.0.0-20201216005158-039620a65673 // indirect
	gitlab.com/q-dev/system-contracts v1.0.0-rc.5.0.20220603095006-aacc5f400f99
	golang.org/x/mod v0.9.0 // indirect
	golang.org/x/net v0.8.0 // indirect
	golang.org/x/xerrors v0.0.0-20220517211312-f3a8303e98df // indirect
	google.golang.org/protobuf v1.28.1 // indirect
	gopkg.in/yaml.v2 v2.4.0 // indirect
	gopkg.in/yaml.v3 v3.0.1 // indirect
	rsc.io/tmplfunc v0.0.3 // indirect
)

exclude gitlab.com/q-dev/q-client v1.9.22-0.20211124080536-fe063185527d
