%YAML 1.1
%TAG !u! tag:unity3d.com,2011:
--- !u!114 &11400000
MonoBehaviour:
  m_ObjectHideFlags: 0
  m_CorrespondingSourceObject: {fileID: 0}
  m_PrefabInstance: {fileID: 0}
  m_PrefabAsset: {fileID: 0}
  m_GameObject: {fileID: 0}
  m_Enabled: 1
  m_EditorHideFlags: 0
  m_Script: {fileID: 11500000, guid: 4f9b2122bcbb4221a29188d883a752f6, type: 3}
  m_Name: GameConfiguration
  m_EditorClassIdentifier: 
  _playerBlueprint: {fileID: 11400000, guid: cfccd2a5200aeba4d950c256f369c891, type: 2}
  _waves:
  - {fileID: 11400000, guid: 10ea4bfb95970c147bbf53d6c4b7d879, type: 2}
  - {fileID: 11400000, guid: 0f0cbe90665215a46997508c25ef232c, type: 2}
  _heroAbilities:
  - {fileID: 11400000, guid: 4d69578368c7e504c962583a76bec6d6, type: 2}
