          В строке можно вводить символы без учета регистра
 
 константы  : "t"=True, "f"=False
 скобки     : "(",")"
 операции   : "v"=OR,"&"=AND
 переменные : латинские символы (один под переменную)
 
 Mes : ab // ERROR, т.к. между операндами отсутствует знак операции

 Def.: Будем называть переменную Xi для функции F=F(X1,...,Xi-1,Xi,Xi+1,...,Xn)
       ЗНАЧИМОЙ,если F(X1,...,Xi-1,0,Xi+1,...,Xn)<>F(X1,...,Xi-1,0,Xi+1,...,Xn)
       иначе НЕ ЗНАЧИМОЙ. (значимая - влияющая на результат)

ЭВРИСТИКА: Т.к. отсутствует операция NOT, задать не значимые переменные можно 
           только используя константы "t" или "f". Если в введенных функциях 
           отсутствуют конструкции вида : F=h(...)&False или F=h(...)vTrue, то 
           каждая переменная функции является значимой. 

ЭВРИСТИКА: F1(X1,...,Xn) и F2(X1,...,Xn,Xn+1) не эквивалентны, если переменная 
           Xn+1 - значимая. Т.к. существует два набора (T1,...,Tn,0) и 
           (T1,...,Tn,1), которые меняют значение F2 и не меняют F1.
________________________________________________________________________________
