<svg width="50" height="50" viewBox="0 0 50 50" fill="none" xmlns="http://www.w3.org/2000/svg">
<circle cx="25" cy="25" r="24" stroke="#1D2128" stroke-width="2"/>
<line x1="23.8572" y1="11.4286" x2="23.8572" y2="27.1429" stroke="#1D2128" stroke-width="2" stroke-linejoin="round"/>
<line x1="38" y1="26" x2="24" y2="26" stroke="#1D2128" stroke-width="2" stroke-linejoin="round"/>
</svg>
