<svg width="53" height="50" viewBox="0 0 53 50" fill="none" xmlns="http://www.w3.org/2000/svg">
<path d="M38.7547 5.72391C38.1688 5.72391 37.7503 5.21886 37.7503 4.62963C37.7503 4.0404 38.1688 3.53535 38.7547 3.53535H48.4643C49.7199 3.53535 50.808 4.0404 51.5614 4.88215C52.3147 5.63973 52.8169 6.73401 52.8169 7.91246V45.6229C52.8169 46.8855 52.3147 47.9798 51.5614 48.7374C50.808 49.4949 49.7199 50 48.4643 50H4.35258C3.09703 50 2.09259 49.4949 1.25555 48.7374C0.502221 47.9798 0 46.8855 0 45.6229V7.91246C0 6.73401 0.502221 5.63973 1.25555 4.88215C2.09259 4.0404 3.09703 3.53535 4.35258 3.53535H11.9696C12.5555 3.53535 12.974 4.0404 12.974 4.62963C12.974 5.21886 12.5555 5.72391 11.9696 5.72391H4.35258C3.68295 5.72391 3.18073 5.97643 2.76222 6.39731C2.3437 6.73401 2.09259 7.32323 2.09259 7.91246V45.6229C2.09259 46.2963 2.3437 46.8013 2.76222 47.2222C3.18073 47.6431 3.68295 47.8956 4.35258 47.8956H48.4643C49.1339 47.8956 49.6362 47.6431 50.0547 47.2222C50.4732 46.8013 50.7243 46.2963 50.7243 45.6229V7.91246C50.7243 7.32323 50.4732 6.73401 50.0547 6.39731C49.6362 5.97643 49.1339 5.72391 48.4643 5.72391H38.7547Z" fill="#1D2128"/>
<path d="M15.4851 1.09428C15.4851 0.505051 15.9874 0 16.5733 0C17.1592 0 17.5777 0.505051 17.5777 1.09428V8.24916C17.5777 8.83838 17.1592 9.34344 16.5733 9.34344C15.9874 9.34344 15.4851 8.83838 15.4851 8.24916V1.09428Z" fill="#1D2128"/>
<path d="M33.0629 1.09428C33.0629 0.505051 33.5651 0 34.151 0C34.7369 0 35.1555 0.505051 35.1555 1.09428V8.24916C35.1555 8.83838 34.7369 9.34344 34.151 9.34344C33.5651 9.34344 33.0629 8.83838 33.0629 8.24916V1.09428Z" fill="#1D2128"/>
<path d="M19.8978 17.3054V36.2661H17.9759V19.039H13.5715V17.3054H19.8978Z" fill="#1D2128"/>
<path d="M31.8117 36.4286C30.3703 36.4286 29.0801 36.0404 27.9412 35.2639C26.8201 34.4874 25.9392 33.3768 25.2986 31.9322C24.6758 30.4695 24.3643 28.754 24.3643 26.7857C24.3643 24.8174 24.6758 23.111 25.2986 21.6664C25.9392 20.2037 26.8201 19.0841 27.9412 18.3076C29.0801 17.5311 30.3703 17.1429 31.8117 17.1429C33.2532 17.1429 34.5344 17.5311 35.6555 18.3076C36.7945 19.0841 37.6842 20.2037 38.3249 21.6664C38.9655 23.111 39.2858 24.8174 39.2858 26.7857C39.2858 28.754 38.9655 30.4695 38.3249 31.9322C37.6842 33.3768 36.7945 34.4874 35.6555 35.2639C34.5344 36.0404 33.2532 36.4286 31.8117 36.4286ZM31.8117 34.6409C32.8973 34.6409 33.8493 34.3339 34.6679 33.7199C35.5043 33.106 36.1538 32.2121 36.6165 31.0383C37.0792 29.8646 37.3105 28.4471 37.3105 26.7857C37.3105 25.1244 37.0792 23.7069 36.6165 22.5331C36.1538 21.3594 35.5043 20.4655 34.6679 19.8516C33.8493 19.2376 32.8973 18.9306 31.8117 18.9306C30.7262 18.9306 29.7653 19.2376 28.9289 19.8516C28.1103 20.4655 27.4696 21.3594 27.007 22.5331C26.5443 23.7069 26.3129 25.1244 26.3129 26.7857C26.3129 28.4471 26.5443 29.8646 27.007 31.0383C27.4696 32.2121 28.1103 33.106 28.9289 33.7199C29.7653 34.3339 30.7262 34.6409 31.8117 34.6409Z" fill="#1D2128"/>
</svg>
