EESchema Schematic File Version 4
LIBS:espresso-on-crack-cache
EELAYER 26 0
EELAYER END
$Descr A4 11693 8268
encoding utf-8
Sheet 1 1
Title "Espresso For Geeks"
Date "2018-02-07"
Rev ""
Comp ""
Comment1 ""
Comment2 ""
Comment3 ""
Comment4 ""
$EndDescr
$Comp
L espresso-on-crack-rescue:LPC1768 THE_BRAIN1
U 1 1 5A7B1F7A
P 6250 3950
F 0 "THE_BRAIN1" H 5900 5000 39  0000 C CNN
F 1 "LPC1768" H 6250 4900 60  0000 C CNN
F 2 "Espresso_on_crack:LPC1768" H 6250 3950 60  0001 C CNN
F 3 "" H 6250 3950 60  0001 C CNN
	1    6250 3950
	1    0    0    -1  
$EndComp
$Comp
L power:GNDD #PWR01
U 1 1 5A7B20D0
P 5250 2800
F 0 "#PWR01" H 5250 2550 50  0001 C CNN
F 1 "GNDD" H 5250 2675 50  0000 C CNN
F 2 "" H 5250 2800 50  0001 C CNN
F 3 "" H 5250 2800 50  0001 C CNN
	1    5250 2800
	1    0    0    -1  
$EndComp
$Comp
L power:VDD #PWR02
U 1 1 5A7B607B
P 7300 2800
F 0 "#PWR02" H 7300 2650 50  0001 C CNN
F 1 "VDD" H 7300 2950 50  0000 C CNN
F 2 "" H 7300 2800 50  0001 C CNN
F 3 "" H 7300 2800 50  0001 C CNN
	1    7300 2800
	1    0    0    -1  
$EndComp
NoConn ~ 7050 3900
NoConn ~ 7050 3800
NoConn ~ 7050 3700
NoConn ~ 7050 3600
NoConn ~ 7050 3500
NoConn ~ 7050 3400
NoConn ~ 7050 3300
NoConn ~ 5450 3200
NoConn ~ 5450 3300
Text Label 5450 3400 2    39   ~ 0
LCD_SI
Text Label 5450 3500 2    39   ~ 0
LCD_RESET
Text Label 5450 3600 2    39   ~ 0
LCD_SCL
Text Label 5450 3700 2    39   ~ 0
LCD_A0
Text Label 5450 4000 2    39   ~ 0
LCD_CS_N
Text Label 7050 4000 0    39   ~ 0
JS_UP
Text Label 7050 4100 0    39   ~ 0
JS_DOWN
Text Label 7050 4200 0    39   ~ 0
JS_LEFT
Text Label 7050 4300 0    39   ~ 0
JS_RIGHT
Text Label 5450 3800 2    39   ~ 0
JS_PUSH
NoConn ~ 7050 3200
Text Label 5450 4900 2    39   ~ 0
PRESSURE_IN
Text Label 5450 3900 2    39   ~ 0
VALVE_CTRL
Text Label 7050 4400 0    39   ~ 0
BOILER_CTRL
Text Label 5450 4100 2    39   ~ 0
ZCD_IN
Text Label 5450 4200 2    39   ~ 0
PUMP_CTRL
Text Label 5450 4300 2    39   ~ 0
TEMP_IN
Text Label 5450 4400 2    39   ~ 0
FLOW_IN
NoConn ~ 7050 4600
NoConn ~ 7050 4900
NoConn ~ 5450 4700
NoConn ~ 5450 4600
NoConn ~ 5450 4500
Text Label 7050 3100 0    39   ~ 0
MBED_VU
$Comp
L esspresso-on-crack:LMT01 BOILER_TEMP1
U 1 1 5A7D24A0
P 10450 2600
F 0 "BOILER_TEMP1" H 10450 2950 39  0000 C CNN
F 1 "LMT01" H 10450 2600 60  0000 C CNN
F 2 "" H 10450 2600 60  0001 C CNN
F 3 "" H 10450 2600 60  0001 C CNN
	1    10450 2600
	1    0    0    -1  
$EndComp
$Comp
L esspresso-on-crack:HCPL-817 ZCD_OPTO1
U 1 1 5A7D2B71
P 3150 5850
F 0 "ZCD_OPTO1" H 3050 5650 39  0000 L CNN
F 1 "HCPL-817" H 3000 6050 39  0000 L CNN
F 2 "Housings_DIP:DIP-4_W7.62mm" H 2950 5650 50  0001 L CIN
F 3 "" H 3150 5850 50  0001 L CNN
	1    3150 5850
	-1   0    0    1   
$EndComp
$Comp
L esspresso-on-crack:NHD-C12832A1Z PANEL_LCD1
U 1 1 5A7D3D8A
P 10200 4400
F 0 "PANEL_LCD1" H 10150 5550 39  0000 C CNN
F 1 "NHD-C12832A1Z" V 10400 4400 59  0000 C CNN
F 2 "Espresso_on_crack:NHD-C12832A1Z" H 10200 4400 60  0001 C CNN
F 3 "" H 10200 4400 60  0000 C CNN
F 4 "Single-row" H 10020 3320 5   0001 L BNN "Field4"
	1    10200 4400
	1    0    0    -1  
$EndComp
$Comp
L espresso-on-crack-rescue:R R5
U 1 1 5A7D9657
P 9500 3400
F 0 "R5" V 9400 3400 50  0000 C CNN
F 1 "220" V 9500 3400 50  0000 C CNN
F 2 "Resistors_THT:R_Axial_DIN0207_L6.3mm_D2.5mm_P7.62mm_Horizontal" V 9430 3400 50  0001 C CNN
F 3 "" H 9500 3400 50  0001 C CNN
	1    9500 3400
	0    1    1    0   
$EndComp
$Comp
L espresso-on-crack-rescue:C_Small C7
U 1 1 5A7D9D09
P 9700 3600
F 0 "C7" V 9660 3640 39  0000 L CNN
F 1 "100nF" V 9660 3380 39  0000 L CNN
F 2 "Capacitors_THT:C_Disc_D5.0mm_W2.5mm_P2.50mm" H 9700 3600 50  0001 C CNN
F 3 "" H 9700 3600 50  0001 C CNN
	1    9700 3600
	0    1    1    0   
$EndComp
$Comp
L espresso-on-crack-rescue:C_Small C6
U 1 1 5A7D9D8A
P 9540 3700
F 0 "C6" V 9500 3740 39  0000 L CNN
F 1 "100nF" V 9500 3480 39  0000 L CNN
F 2 "Capacitors_THT:C_Disc_D5.0mm_W2.5mm_P2.50mm" H 9540 3700 50  0001 C CNN
F 3 "" H 9540 3700 50  0001 C CNN
	1    9540 3700
	0    1    1    0   
$EndComp
$Comp
L espresso-on-crack-rescue:C_Small C4
U 1 1 5A7DA4C1
P 9370 3800
F 0 "C4" V 9330 3840 39  0000 L CNN
F 1 "100nF" V 9330 3580 39  0000 L CNN
F 2 "Capacitors_THT:C_Disc_D5.0mm_W2.5mm_P2.50mm" H 9370 3800 50  0001 C CNN
F 3 "" H 9370 3800 50  0001 C CNN
	1    9370 3800
	0    1    1    0   
$EndComp
$Comp
L espresso-on-crack-rescue:C_Small C2
U 1 1 5A7DA549
P 9200 3900
F 0 "C2" V 9160 3940 39  0000 L CNN
F 1 "100nF" V 9160 3680 39  0000 L CNN
F 2 "Capacitors_THT:C_Disc_D5.0mm_W2.5mm_P2.50mm" H 9200 3900 50  0001 C CNN
F 3 "" H 9200 3900 50  0001 C CNN
	1    9200 3900
	0    1    1    0   
$EndComp
$Comp
L espresso-on-crack-rescue:C_Small C1
U 1 1 5A7DA620
P 9020 4000
F 0 "C1" V 8980 4040 39  0000 L CNN
F 1 "100nF" V 8980 3780 39  0000 L CNN
F 2 "Capacitors_THT:C_Disc_D5.0mm_W2.5mm_P2.50mm" H 9020 4000 50  0001 C CNN
F 3 "" H 9020 4000 50  0001 C CNN
	1    9020 4000
	0    1    1    0   
$EndComp
$Comp
L espresso-on-crack-rescue:C_Small C5
U 1 1 5A7DAA89
P 9500 4100
F 0 "C5" V 9460 4140 39  0000 L CNN
F 1 "100nF" V 9460 3880 39  0000 L CNN
F 2 "Capacitors_THT:C_Disc_D5.0mm_W2.5mm_P2.50mm" H 9500 4100 50  0001 C CNN
F 3 "" H 9500 4100 50  0001 C CNN
	1    9500 4100
	0    1    1    0   
$EndComp
$Comp
L espresso-on-crack-rescue:C_Small C3
U 1 1 5A7DABF0
P 9200 4300
F 0 "C3" V 9160 4340 39  0000 L CNN
F 1 "100nF" V 9160 4080 39  0000 L CNN
F 2 "Capacitors_THT:C_Disc_D5.0mm_W2.5mm_P2.50mm" H 9200 4300 50  0001 C CNN
F 3 "" H 9200 4300 50  0001 C CNN
	1    9200 4300
	0    1    1    0   
$EndComp
$Comp
L espresso-on-crack-rescue:C_Small C8
U 1 1 5A7DACDF
P 9700 4500
F 0 "C8" V 9660 4540 39  0000 L CNN
F 1 "100nF" V 9660 4280 39  0000 L CNN
F 2 "Capacitors_THT:C_Disc_D5.0mm_W2.5mm_P2.50mm" H 9700 4500 50  0001 C CNN
F 3 "" H 9700 4500 50  0001 C CNN
	1    9700 4500
	0    1    1    0   
$EndComp
Text Label 9250 3400 2    39   ~ 0
PANEL_VDD
Text Label 9700 4700 2    39   ~ 0
PANEL_VDD
Text Label 8650 4000 2    39   ~ 0
PANEL_GND
$Comp
L espresso-on-crack-rescue:Conn_01x12 PANEL_BUS1
U 1 1 5A7DBF52
P 8600 5300
F 0 "PANEL_BUS1" H 8550 5900 39  0000 C CNN
F 1 "Conn_01x12" H 8600 4600 39  0000 C CNN
F 2 "Pin_Headers:Pin_Header_Straight_1x12_Pitch2.54mm" H 8600 5300 50  0001 C CNN
F 3 "" H 8600 5300 50  0001 C CNN
	1    8600 5300
	-1   0    0    -1  
$EndComp
Text Label 8800 5800 0    39   ~ 0
PANEL_VDD
Text Label 8800 5900 0    39   ~ 0
PANEL_GND
Text Label 9600 5750 2    39   ~ 0
PANEL_VDD
$Comp
L espresso-on-crack-rescue:Conn_01x12 PANEL_CONN1
U 1 1 5A7E39FB
P 8100 5300
F 0 "PANEL_CONN1" H 8000 5900 39  0000 C CNN
F 1 "Conn_01x12" H 8100 4600 39  0000 C CNN
F 2 "Pin_Headers:Pin_Header_Straight_1x12_Pitch2.54mm" H 8100 5300 50  0001 C CNN
F 3 "" H 8100 5300 50  0001 C CNN
	1    8100 5300
	1    0    0    -1  
$EndComp
Text Label 7900 5100 2    39   ~ 0
LCD_RESET
Text Label 7900 5000 2    39   ~ 0
LCD_A0
Text Label 7900 5200 2    39   ~ 0
LCD_CS_N
Text Label 7900 4900 2    39   ~ 0
LCD_SCL
Text Label 7900 4800 2    39   ~ 0
LCD_SI
Text Label 7900 5500 2    39   ~ 0
JS_UP
Text Label 7900 5600 2    39   ~ 0
JS_LEFT
Text Label 7900 5400 2    39   ~ 0
JS_RIGHT
Text Label 7900 5300 2    39   ~ 0
JS_DOWN
Text Label 7900 5700 2    39   ~ 0
JS_PUSH
$Comp
L power:VDD #PWR03
U 1 1 5A7ED981
P 7450 5800
F 0 "#PWR03" H 7450 5650 50  0001 C CNN
F 1 "VDD" H 7450 5950 50  0000 C CNN
F 2 "" H 7450 5800 50  0001 C CNN
F 3 "" H 7450 5800 50  0001 C CNN
	1    7450 5800
	1    0    0    -1  
$EndComp
$Comp
L power:GNDD #PWR04
U 1 1 5A7EDA11
P 7650 5900
F 0 "#PWR04" H 7650 5650 50  0001 C CNN
F 1 "GNDD" H 7650 5775 50  0000 C CNN
F 2 "" H 7650 5900 50  0001 C CNN
F 3 "" H 7650 5900 50  0001 C CNN
	1    7650 5900
	1    0    0    -1  
$EndComp
$Comp
L espresso-on-crack-rescue:R R4
U 1 1 5A7FB620
P 9150 2800
F 0 "R4" V 9230 2800 50  0000 C CNN
F 1 "10k" V 9150 2800 50  0000 C CNN
F 2 "Resistors_THT:R_Axial_DIN0207_L6.3mm_D2.5mm_P7.62mm_Horizontal" V 9080 2800 50  0001 C CNN
F 3 "" H 9150 2800 50  0001 C CNN
	1    9150 2800
	1    0    0    -1  
$EndComp
$Comp
L espresso-on-crack-rescue:2N3904 Q1
U 1 1 5A7FB7D1
P 8800 2650
F 0 "Q1" H 8700 2500 50  0000 L CNN
F 1 "2N3904" H 8500 2750 39  0000 L CNN
F 2 "TO_SOT_Packages_THT:TO-92_Inline_Wide" H 9000 2575 50  0001 L CIN
F 3 "" H 8800 2650 50  0001 L CNN
	1    8800 2650
	-1   0    0    -1  
$EndComp
$Comp
L power:VDD #PWR05
U 1 1 5A7FD487
P 9150 2550
F 0 "#PWR05" H 9150 2400 50  0001 C CNN
F 1 "VDD" H 9150 2700 50  0000 C CNN
F 2 "" H 9150 2550 50  0001 C CNN
F 3 "" H 9150 2550 50  0001 C CNN
	1    9150 2550
	1    0    0    -1  
$EndComp
$Comp
L power:GNDD #PWR06
U 1 1 5A7FD53C
P 8600 2950
F 0 "#PWR06" H 8600 2700 50  0001 C CNN
F 1 "GNDD" H 8600 2825 50  0000 C CNN
F 2 "" H 8600 2950 50  0001 C CNN
F 3 "" H 8600 2950 50  0001 C CNN
	1    8600 2950
	1    0    0    -1  
$EndComp
Text Label 8450 2450 2    39   ~ 0
TEMP_IN
$Comp
L espresso-on-crack-rescue:Conn_01x03 FLOW_WIRE1
U 1 1 5A811B98
P 6250 950
F 0 "FLOW_WIRE1" H 6200 1150 39  0000 C CNN
F 1 "Conn_01x03" H 6250 750 39  0000 C CNN
F 2 "" H 6250 950 50  0001 C CNN
F 3 "" H 6250 950 50  0001 C CNN
	1    6250 950 
	-1   0    0    -1  
$EndComp
$Comp
L espresso-on-crack-rescue:Conn_01x03 FLOW_CONN1
U 1 1 5A81234D
P 5850 950
F 0 "FLOW_CONN1" H 5800 1150 39  0000 C CNN
F 1 "Conn_01x03" H 5850 750 39  0000 C CNN
F 2 "Pin_Headers:Pin_Header_Straight_1x03_Pitch2.54mm" H 5850 950 50  0001 C CNN
F 3 "" H 5850 950 50  0001 C CNN
	1    5850 950 
	1    0    0    -1  
$EndComp
Text Label 5650 850  2    39   ~ 0
MBED_VU
$Comp
L power:GNDD #PWR07
U 1 1 5A813928
P 5200 950
F 0 "#PWR07" H 5200 700 50  0001 C CNN
F 1 "GNDD" H 5200 825 50  0000 C CNN
F 2 "" H 5200 950 50  0001 C CNN
F 3 "" H 5200 950 50  0001 C CNN
	1    5200 950 
	1    0    0    -1  
$EndComp
Text Label 5650 1050 2    39   ~ 0
FLOW_IN
$Comp
L espresso-on-crack-rescue:Conn_01x03 PRESSURE_WIRE1
U 1 1 5A823650
P 9650 950
F 0 "PRESSURE_WIRE1" H 9500 1150 39  0000 C CNN
F 1 "Conn_01x03" H 9650 750 39  0000 C CNN
F 2 "" H 9650 950 50  0001 C CNN
F 3 "" H 9650 950 50  0001 C CNN
	1    9650 950 
	-1   0    0    -1  
$EndComp
$Comp
L espresso-on-crack-rescue:Conn_01x03 PRESSURE_CONN1
U 1 1 5A82384D
P 9250 950
F 0 "PRESSURE_CONN1" H 9100 1150 39  0000 C CNN
F 1 "Conn_01x03" H 9250 750 39  0000 C CNN
F 2 "Pin_Headers:Pin_Header_Straight_1x03_Pitch2.54mm" H 9250 950 50  0001 C CNN
F 3 "" H 9250 950 50  0001 C CNN
	1    9250 950 
	1    0    0    -1  
$EndComp
Text Label 9050 850  2    39   ~ 0
MBED_VU
Text Label 9050 1050 2    39   ~ 0
PRESSURE_IN
$Comp
L power:GNDD #PWR08
U 1 1 5A828AA0
P 8550 950
F 0 "#PWR08" H 8550 700 50  0001 C CNN
F 1 "GNDD" H 8550 825 50  0000 C CNN
F 2 "" H 8550 950 50  0001 C CNN
F 3 "" H 8550 950 50  0001 C CNN
	1    8550 950 
	1    0    0    -1  
$EndComp
$Comp
L esspresso-on-crack:GENERIC_PRESSURE_TRANSDUCER PRESSURE_METER1
U 1 1 5A82AF60
P 10400 950
F 0 "PRESSURE_METER1" H 10450 1200 39  0000 C CNN
F 1 "GENERIC_PRESSURE_TRANSDUCER" H 10400 700 39  0000 C CNN
F 2 "" H 10400 950 39  0001 C CNN
F 3 "" H 10400 950 39  0001 C CNN
	1    10400 950 
	1    0    0    -1  
$EndComp
$Comp
L esspresso-on-crack:FHKSC-932-950 FLOW_METER1
U 1 1 5A82B1CB
P 7000 950
F 0 "FLOW_METER1" H 7050 1200 39  0000 C CNN
F 1 "FHKSC-932-950" H 7000 500 39  0000 C CNN
F 2 "" H 7000 800 39  0001 C CNN
F 3 "" H 7000 800 39  0001 C CNN
	1    7000 950 
	-1   0    0    -1  
$EndComp
$Comp
L esspresso-on-crack:JS-5208 NAV_JOYSTICK1
U 1 1 5A82DB67
P 9950 5950
F 0 "NAV_JOYSTICK1" H 9900 6250 39  0000 C CNN
F 1 "JS-5208" H 9950 5650 39  0000 C CNN
F 2 "Espresso_on_crack:JS-5208" H 9950 5950 60  0001 C CNN
F 3 "" H 9950 5950 60  0001 C CNN
	1    9950 5950
	1    0    0    -1  
$EndComp
$Comp
L esspresso-on-crack:AQH3223 PUMP_SSR1
U 1 1 5A82F687
P 3050 6200
F 0 "PUMP_SSR1" H 2900 6150 39  0000 C CNN
F 1 "AQH3223" H 3050 5250 39  0000 C CNN
F 2 "Housings_DIP:DIP-8_W7.62mm" H 3050 6200 39  0001 C CNN
F 3 "" H 3050 6200 39  0001 C CNN
	1    3050 6200
	1    0    0    -1  
$EndComp
$Comp
L esspresso-on-crack:AQH3223 VALVE_SSR1
U 1 1 5A82F6E4
P 3050 4500
F 0 "VALVE_SSR1" H 2900 4450 39  0000 C CNN
F 1 "AQH3223" H 3050 3550 39  0000 C CNN
F 2 "Housings_DIP:DIP-8_W7.62mm" H 3050 4500 39  0001 C CNN
F 3 "" H 3050 4500 39  0001 C CNN
	1    3050 4500
	1    0    0    -1  
$EndComp
$Comp
L esspresso-on-crack:FOTEK-SSR-25DA BOILER_SSR1
U 1 1 5A8304E5
P 2500 1200
F 0 "BOILER_SSR1" H 2300 1400 39  0000 L CNN
F 1 "FOTEK-SSR-25DA" H 2500 1000 39  0000 C CNN
F 2 "" H 2300 1000 50  0001 L CIN
F 3 "" H 2465 1200 50  0001 L CNN
	1    2500 1200
	-1   0    0    1   
$EndComp
$Comp
L espresso-on-crack-rescue:Conn_01x02 TEMP_CONN1
U 1 1 5A84319D
P 9500 2550
F 0 "TEMP_CONN1" H 9450 2650 39  0000 C CNN
F 1 "Conn_01x02" H 9500 2350 39  0000 C CNN
F 2 "Pin_Headers:Pin_Header_Straight_1x02_Pitch2.54mm" H 9500 2550 50  0001 C CNN
F 3 "" H 9500 2550 50  0001 C CNN
	1    9500 2550
	1    0    0    -1  
$EndComp
$Comp
L espresso-on-crack-rescue:Conn_01x02 TEMP_WIRE1
U 1 1 5A8438E4
P 9900 2550
F 0 "TEMP_WIRE1" H 9900 2650 39  0000 C CNN
F 1 "Conn_01x02" H 9900 2350 39  0000 C CNN
F 2 "" H 9900 2550 50  0001 C CNN
F 3 "" H 9900 2550 50  0001 C CNN
	1    9900 2550
	-1   0    0    -1  
$EndComp
$Comp
L esspresso-on-crack:ULKA_PUMP PUMP1
U 1 1 5A85E621
P 2650 3300
F 0 "PUMP1" H 2650 3950 39  0000 C CNN
F 1 "48W_VIBRATORY_PUMP" H 2670 2980 39  0000 C CNN
F 2 "" H 2800 3200 60  0001 C CNN
F 3 "" H 2800 3200 60  0001 C CNN
	1    2650 3300
	1    0    0    -1  
$EndComp
$Comp
L esspresso-on-crack:SOLENOID_VALVE VALVE1
U 1 1 5A863E25
P 1350 3200
F 0 "VALVE1" H 1150 3550 39  0000 C CNN
F 1 "SOLENOID_VALVE" H 1350 2800 39  0000 C CNN
F 2 "" H 1350 3200 60  0001 C CNN
F 3 "" H 1350 3200 60  0001 C CNN
	1    1350 3200
	1    0    0    -1  
$EndComp
$Comp
L esspresso-on-crack:BOILER_HEATER R1
U 1 1 5A8655D5
P 2200 1950
F 0 "R1" V 2360 1950 50  0000 C CNN
F 1 "BOILER_HEATER" V 2050 1960 39  0000 C CNN
F 2 "" V 2130 1950 50  0001 C CNN
F 3 "" H 2200 1950 50  0001 C CNN
	1    2200 1950
	1    0    0    -1  
$EndComp
$Comp
L esspresso-on-crack:BOILER_HEATER R2
U 1 1 5A865660
P 2600 1950
F 0 "R2" V 2760 1950 50  0000 C CNN
F 1 "BOILER_HEATER" V 2450 1960 39  0000 C CNN
F 2 "" V 2530 1950 50  0001 C CNN
F 3 "" H 2600 1950 50  0001 C CNN
	1    2600 1950
	1    0    0    -1  
$EndComp
$Comp
L espresso-on-crack-rescue:Conn_WallSocket J1
U 1 1 5A866F63
P 1000 2050
F 0 "J1" H 1050 2225 50  0000 C BNN
F 1 "AC_Socket" V 1200 2050 50  0000 C BNN
F 2 "" H 600 2050 50  0001 C CNN
F 3 "" H 600 2050 50  0001 C CNN
	1    1000 2050
	-1   0    0    -1  
$EndComp
$Comp
L esspresso-on-crack:ET125A-Z PANEL_MAIN_SWITCH1
U 1 1 5A867ED5
P 1400 1400
F 0 "PANEL_MAIN_SWITCH1" H 1400 1850 39  0000 C CNN
F 1 "ET125A-Z" H 1450 1150 39  0000 C CNN
F 2 "" H 1450 1300 50  0001 C CNN
F 3 "" H 1450 1300 50  0001 C CNN
	1    1400 1400
	1    0    0    -1  
$EndComp
$Comp
L espresso-on-crack-rescue:Conn_01x02 BOILER_WIRE1
U 1 1 5A86AED4
P 3150 1250
F 0 "BOILER_WIRE1" H 3150 1350 39  0000 C CNN
F 1 "Conn_01x02" H 3150 1050 39  0000 C CNN
F 2 "" H 3150 1250 50  0001 C CNN
F 3 "" H 3150 1250 50  0001 C CNN
	1    3150 1250
	1    0    0    1   
$EndComp
$Comp
L espresso-on-crack-rescue:Conn_01x02 BOILER_CONN1
U 1 1 5A86AFA9
P 3600 1250
F 0 "BOILER_CONN1" H 3500 1350 39  0000 C CNN
F 1 "Conn_01x02" H 3600 1050 39  0000 C CNN
F 2 "Pin_Headers:Pin_Header_Straight_1x02_Pitch2.54mm" H 3600 1250 50  0001 C CNN
F 3 "" H 3600 1250 50  0001 C CNN
	1    3600 1250
	-1   0    0    1   
$EndComp
Text Label 3800 1250 0    39   ~ 0
BOILER_CTRL
$Comp
L power:GNDD #PWR09
U 1 1 5A86C60C
P 4400 1150
F 0 "#PWR09" H 4400 900 50  0001 C CNN
F 1 "GNDD" H 4400 1025 39  0000 C CNN
F 2 "" H 4400 1150 50  0001 C CNN
F 3 "" H 4400 1150 50  0001 C CNN
	1    4400 1150
	1    0    0    -1  
$EndComp
$Comp
L espresso-on-crack-rescue:GNDPWR #PWR010
U 1 1 5A872B8F
P 1300 2250
F 0 "#PWR010" H 1300 2050 50  0001 C CNN
F 1 "GNDPWR" H 1300 2120 39  0000 C CNN
F 2 "" H 1300 2200 50  0001 C CNN
F 3 "" H 1300 2200 50  0001 C CNN
	1    1300 2250
	1    0    0    -1  
$EndComp
$Comp
L espresso-on-crack-rescue:GNDPWR #PWR011
U 1 1 5A872D58
P 2200 2250
F 0 "#PWR011" H 2200 2050 50  0001 C CNN
F 1 "GNDPWR" H 2200 2120 39  0000 C CNN
F 2 "" H 2200 2200 50  0001 C CNN
F 3 "" H 2200 2200 50  0001 C CNN
	1    2200 2250
	1    0    0    -1  
$EndComp
NoConn ~ 3550 5300
$Comp
L espresso-on-crack-rescue:GNDPWR #PWR012
U 1 1 5A884A8F
P 1850 3300
F 0 "#PWR012" H 1850 3100 50  0001 C CNN
F 1 "GNDPWR" H 1850 3170 39  0000 C CNN
F 2 "" H 1850 3250 50  0001 C CNN
F 3 "" H 1850 3250 50  0001 C CNN
	1    1850 3300
	1    0    0    -1  
$EndComp
$Comp
L espresso-on-crack-rescue:GNDPWR #PWR013
U 1 1 5A88DD0B
P 3050 3350
F 0 "#PWR013" H 3050 3150 50  0001 C CNN
F 1 "GNDPWR" H 3050 3220 39  0000 C CNN
F 2 "" H 3050 3300 50  0001 C CNN
F 3 "" H 3050 3300 50  0001 C CNN
	1    3050 3350
	1    0    0    -1  
$EndComp
Text Label 1750 3100 0    39   ~ 0
VALVE_POWER
Text Label 2900 3100 0    39   ~ 0
PUMP_POWER
$Comp
L espresso-on-crack-rescue:D D1
U 1 1 5A891E30
P 3600 5850
F 0 "D1" H 3600 5950 39  0000 C CNN
F 1 "1N4007" H 3600 5750 39  0000 C CNN
F 2 "Diodes_THT:D_DO-41_SOD81_P7.62mm_Horizontal" H 3600 5850 50  0001 C CNN
F 3 "" H 3600 5850 50  0001 C CNN
	1    3600 5850
	0    -1   -1   0   
$EndComp
$Comp
L espresso-on-crack-rescue:R R3
U 1 1 5A892075
P 3850 5700
F 0 "R3" V 3750 5700 39  0000 C CNN
F 1 "7k" V 3850 5700 39  0000 C CNN
F 2 "Resistors_THT:R_Axial_Power_L25.0mm_W6.4mm_P27.94mm" V 3780 5700 50  0001 C CNN
F 3 "" H 3850 5700 50  0001 C CNN
F 4 "5W" V 3850 5700 60  0001 C CNN "Power Rating"
	1    3850 5700
	0    1    1    0   
$EndComp
NoConn ~ 3550 7000
$Comp
L espresso-on-crack-rescue:Conn_01x04 HV_BUS1
U 1 1 5A896B2B
P 1900 5800
F 0 "HV_BUS1" H 1900 6000 39  0000 C CNN
F 1 "Conn_01x04" H 1900 5500 39  0000 C CNN
F 2 "Pin_Headers:Pin_Header_Straight_1x04_Pitch2.54mm" H 1900 5800 50  0001 C CNN
F 3 "" H 1900 5800 50  0001 C CNN
	1    1900 5800
	-1   0    0    -1  
$EndComp
$Comp
L espresso-on-crack-rescue:Conn_01x04 HV_CONN1
U 1 1 5A897726
P 1500 5800
F 0 "HV_CONN1" H 1500 6000 39  0000 C CNN
F 1 "Conn_01x04" H 1500 5500 39  0000 C CNN
F 2 "Pin_Headers:Pin_Header_Straight_1x04_Pitch2.54mm" H 1500 5800 50  0001 C CNN
F 3 "" H 1500 5800 50  0001 C CNN
	1    1500 5800
	1    0    0    -1  
$EndComp
NoConn ~ 2550 5300
NoConn ~ 2550 4700
NoConn ~ 2550 6400
NoConn ~ 2550 7000
$Comp
L power:GNDD #PWR014
U 1 1 5A897EFB
P 750 5800
F 0 "#PWR014" H 750 5550 50  0001 C CNN
F 1 "GNDD" H 750 5675 39  0000 C CNN
F 2 "" H 750 5800 50  0001 C CNN
F 3 "" H 750 5800 50  0001 C CNN
	1    750  5800
	1    0    0    -1  
$EndComp
Text Label 1300 5700 2    39   ~ 0
VALVE_CTRL
Text Label 1300 5900 2    39   ~ 0
ZCD_IN
Text Label 1300 6000 2    39   ~ 0
PUMP_CTRL
$Comp
L power:+5V #PWR015
U 1 1 5A8CC310
P 4900 3100
F 0 "#PWR015" H 4900 2950 50  0001 C CNN
F 1 "+5V" H 4900 3240 50  0000 C CNN
F 2 "" H 4900 3100 50  0001 C CNN
F 3 "" H 4900 3100 50  0001 C CNN
	1    4900 3100
	1    0    0    -1  
$EndComp
$Comp
L esspresso-on-crack:120V #PWR016
U 1 1 5A92F8FE
P 1700 1600
F 0 "#PWR016" H 1700 1500 50  0001 C CNN
F 1 "120V" H 1700 1850 39  0000 C CNN
F 2 "" H 1700 1600 50  0001 C CNN
F 3 "" H 1700 1600 50  0001 C CNN
	1    1700 1600
	1    0    0    -1  
$EndComp
$Comp
L esspresso-on-crack:120V #PWR017
U 1 1 5A92FFAE
P 2050 1100
F 0 "#PWR017" H 2050 1000 50  0001 C CNN
F 1 "120V" H 2050 1350 39  0000 C CNN
F 2 "" H 2050 1100 50  0001 C CNN
F 3 "" H 2050 1100 50  0001 C CNN
	1    2050 1100
	1    0    0    -1  
$EndComp
$Comp
L espresso-on-crack-rescue:Screw_Terminal_01x04 AC_BLOCK1
U 1 1 5A9471DD
P 4650 5550
F 0 "AC_BLOCK1" H 4750 5250 39  0000 C CNN
F 1 "Screw_Terminal_01x04" H 4700 5750 39  0000 C CNN
F 2 "Connectors_Terminal_Blocks:TerminalBlock_Pheonix_MKDS1.5-4pol" H 4650 5550 50  0001 C CNN
F 3 "" H 4650 5550 50  0001 C CNN
	1    4650 5550
	1    0    0    1   
$EndComp
Text Label 4450 5450 2    39   ~ 0
VALVE_PWR
Text Label 4450 5550 2    39   ~ 0
AC_GND
Text Label 4450 5650 2    39   ~ 0
PUMP_PWR
Wire Wire Line
	7300 2800 7300 3000
Wire Wire Line
	7300 3000 7050 3000
Wire Wire Line
	9800 3700 9640 3700
Wire Wire Line
	9800 3800 9470 3800
Wire Wire Line
	9800 3900 9300 3900
Wire Wire Line
	9800 4000 9120 4000
Wire Wire Line
	9800 3400 9650 3400
Wire Wire Line
	9400 4200 9800 4200
Wire Wire Line
	9100 4300 9100 4400
Wire Wire Line
	9100 4400 9800 4400
Wire Wire Line
	9800 3500 8750 3500
Wire Wire Line
	8750 3500 8750 3600
Wire Wire Line
	8750 4600 9800 4600
Wire Wire Line
	9600 3600 8750 3600
Connection ~ 8750 3600
Connection ~ 8750 3700
Wire Wire Line
	9600 4500 8750 4500
Connection ~ 8750 4500
Wire Wire Line
	9440 3700 8750 3700
Wire Wire Line
	9270 3800 8750 3800
Connection ~ 8750 3800
Wire Wire Line
	9100 3900 8750 3900
Connection ~ 8750 3890
Wire Wire Line
	8650 4000 8750 4000
Connection ~ 8750 4000
Wire Wire Line
	9800 4800 8800 4800
Wire Wire Line
	9800 4900 8800 4900
Wire Wire Line
	9800 5000 8800 5000
Wire Wire Line
	9800 5100 8800 5100
Wire Wire Line
	9800 5200 8800 5200
Wire Wire Line
	10300 6150 10850 6150
Wire Wire Line
	10850 6150 10850 5400
Wire Wire Line
	10850 5400 9550 5400
Wire Wire Line
	9550 5400 9550 5300
Wire Wire Line
	9550 5300 8800 5300
Wire Wire Line
	10300 5950 10750 5950
Wire Wire Line
	10750 5950 10750 5500
Wire Wire Line
	10750 5500 9450 5500
Wire Wire Line
	9450 5500 9450 5400
Wire Wire Line
	9450 5400 8800 5400
Wire Wire Line
	10600 5750 10600 5600
Wire Wire Line
	10600 5600 9350 5600
Wire Wire Line
	9350 5600 9350 5500
Wire Wire Line
	9350 5500 8800 5500
Wire Wire Line
	9600 5950 9250 5950
Wire Wire Line
	9250 5950 9250 5600
Wire Wire Line
	9250 5600 8800 5600
Wire Wire Line
	9600 6150 9150 6150
Wire Wire Line
	9150 6150 9150 5700
Wire Wire Line
	9150 5700 8800 5700
Wire Wire Line
	10600 5750 10300 5750
Wire Wire Line
	9350 3400 9250 3400
Wire Wire Line
	9800 4700 9700 4700
Wire Wire Line
	7900 5800 7450 5800
Wire Wire Line
	7900 5900 7650 5900
Wire Wire Line
	9400 4200 9400 4100
Wire Wire Line
	9000 2650 9150 2650
Connection ~ 9150 2650
Wire Wire Line
	8600 2950 8700 2950
Wire Wire Line
	8700 2950 8700 2850
Connection ~ 8700 2950
Wire Wire Line
	8450 2450 8700 2450
Wire Wire Line
	9800 4100 9600 4100
Wire Wire Line
	9800 4300 9300 4300
Wire Wire Line
	6700 850  6700 900 
Wire Wire Line
	6700 950  6450 950 
Wire Wire Line
	6700 1000 6700 1050
Wire Wire Line
	6700 1050 6450 1050
Wire Wire Line
	5650 950  5200 950 
Wire Wire Line
	10100 2550 10100 2300
Wire Wire Line
	10100 2300 10450 2300
Wire Wire Line
	10450 2900 10100 2900
Wire Wire Line
	10100 2900 10100 2650
Wire Wire Line
	2200 1650 2600 1650
Wire Wire Line
	2600 2250 2200 2250
Wire Wire Line
	2200 1650 2200 1300
Wire Wire Line
	1300 1600 1300 1950
Wire Wire Line
	1200 2150 1300 2150
Wire Wire Line
	1300 2150 1300 2250
Wire Wire Line
	1700 1600 1500 1600
Wire Wire Line
	2800 1100 2950 1100
Wire Wire Line
	2950 1100 2950 1150
Wire Wire Line
	2800 1300 2950 1300
Wire Wire Line
	2950 1300 2950 1250
Wire Wire Line
	2200 1100 2050 1100
Wire Wire Line
	4400 1150 3800 1150
Wire Wire Line
	1750 3300 1850 3300
Wire Wire Line
	3450 5700 3600 5700
Wire Wire Line
	3450 5700 3450 5750
Wire Wire Line
	3450 6000 3600 6000
Wire Wire Line
	3450 6000 3450 5950
Wire Wire Line
	4000 5100 4000 5450
Wire Wire Line
	4000 5100 3550 5100
Wire Wire Line
	2400 6800 2550 6800
Wire Wire Line
	2400 5100 2400 5800
Wire Wire Line
	2550 5100 2400 5100
Connection ~ 2400 5800
Wire Wire Line
	2550 4900 2100 4900
Wire Wire Line
	2850 5950 2850 5900
Wire Wire Line
	2850 5900 2100 5900
Wire Wire Line
	2550 6600 2100 6600
Wire Wire Line
	2100 6600 2100 6000
Wire Wire Line
	2100 5800 2400 5800
Wire Wire Line
	2850 5800 2850 5750
Wire Wire Line
	2100 4900 2100 5700
Wire Wire Line
	1300 5800 750  5800
Wire Wire Line
	2900 3350 3050 3350
Connection ~ 3600 6000
Connection ~ 4000 5450
Connection ~ 2200 1650
Connection ~ 2200 2250
Connection ~ 3600 5700
Wire Wire Line
	5450 3000 5450 2800
Wire Wire Line
	5450 2800 5250 2800
Wire Wire Line
	10100 850  9850 850 
Wire Wire Line
	6700 850  6450 850 
Wire Wire Line
	9300 2550 9150 2550
Wire Wire Line
	5450 3100 4900 3100
Wire Wire Line
	1300 1950 1200 1950
Wire Wire Line
	4100 6000 4100 5550
Wire Wire Line
	4100 5550 4450 5550
Wire Wire Line
	4450 5450 4000 5450
Wire Wire Line
	3550 6800 4200 6800
Wire Wire Line
	4200 6800 4200 5650
Wire Wire Line
	4200 5650 4450 5650
Wire Wire Line
	10100 950  9850 950 
Wire Wire Line
	10100 1050 9850 1050
Wire Wire Line
	9050 950  8550 950 
Wire Wire Line
	4000 6400 3550 6400
Connection ~ 4000 5700
Wire Wire Line
	3550 4700 4100 4700
Wire Wire Line
	4100 4700 4100 5350
Wire Wire Line
	4100 5350 4450 5350
$Comp
L esspresso-on-crack:120V #PWR018
U 1 1 5AA4C732
P 4100 4700
F 0 "#PWR018" H 4100 4600 50  0001 C CNN
F 1 "120V" H 4100 4950 39  0000 C CNN
F 2 "" H 4100 4700 50  0001 C CNN
F 3 "" H 4100 4700 50  0001 C CNN
	1    4100 4700
	1    0    0    -1  
$EndComp
NoConn ~ 5450 4800
$Comp
L esspresso-on-crack:LMT01 BOILER_TEMP2
U 1 1 5AD8776C
P 10450 1800
F 0 "BOILER_TEMP2" H 10450 2150 39  0000 C CNN
F 1 "LMT01" H 10450 1800 60  0000 C CNN
F 2 "" H 10450 1800 60  0001 C CNN
F 3 "" H 10450 1800 60  0001 C CNN
	1    10450 1800
	1    0    0    -1  
$EndComp
$Comp
L espresso-on-crack-rescue:R R6
U 1 1 5AD87772
P 9150 2000
F 0 "R6" V 9230 2000 50  0000 C CNN
F 1 "10k" V 9150 2000 50  0000 C CNN
F 2 "Resistors_THT:R_Axial_DIN0207_L6.3mm_D2.5mm_P7.62mm_Horizontal" V 9080 2000 50  0001 C CNN
F 3 "" H 9150 2000 50  0001 C CNN
	1    9150 2000
	1    0    0    -1  
$EndComp
$Comp
L espresso-on-crack-rescue:2N3904 Q2
U 1 1 5AD87778
P 8800 1850
F 0 "Q2" H 8700 1700 50  0000 L CNN
F 1 "2N3904" H 8500 1950 39  0000 L CNN
F 2 "TO_SOT_Packages_THT:TO-92_Inline_Wide" H 9000 1775 50  0001 L CIN
F 3 "" H 8800 1850 50  0001 L CNN
	1    8800 1850
	-1   0    0    -1  
$EndComp
$Comp
L power:VDD #PWR019
U 1 1 5AD8777E
P 9150 1750
F 0 "#PWR019" H 9150 1600 50  0001 C CNN
F 1 "VDD" H 9150 1900 50  0000 C CNN
F 2 "" H 9150 1750 50  0001 C CNN
F 3 "" H 9150 1750 50  0001 C CNN
	1    9150 1750
	1    0    0    -1  
$EndComp
$Comp
L power:GNDD #PWR020
U 1 1 5AD87784
P 8600 2150
F 0 "#PWR020" H 8600 1900 50  0001 C CNN
F 1 "GNDD" H 8600 2025 50  0000 C CNN
F 2 "" H 8600 2150 50  0001 C CNN
F 3 "" H 8600 2150 50  0001 C CNN
	1    8600 2150
	1    0    0    -1  
$EndComp
$Comp
L espresso-on-crack-rescue:Conn_01x02 TEMP_CONN2
U 1 1 5AD8778B
P 9500 1750
F 0 "TEMP_CONN2" H 9450 1850 39  0000 C CNN
F 1 "Conn_01x02" H 9500 1550 39  0000 C CNN
F 2 "Pin_Headers:Pin_Header_Straight_1x02_Pitch2.54mm" H 9500 1750 50  0001 C CNN
F 3 "" H 9500 1750 50  0001 C CNN
	1    9500 1750
	1    0    0    -1  
$EndComp
$Comp
L espresso-on-crack-rescue:Conn_01x02 TEMP_WIRE2
U 1 1 5AD87791
P 9900 1750
F 0 "TEMP_WIRE2" H 9900 1850 39  0000 C CNN
F 1 "Conn_01x02" H 9900 1550 39  0000 C CNN
F 2 "" H 9900 1750 50  0001 C CNN
F 3 "" H 9900 1750 50  0001 C CNN
	1    9900 1750
	-1   0    0    -1  
$EndComp
Wire Wire Line
	9000 1850 9150 1850
Connection ~ 9150 1850
Wire Wire Line
	8600 2150 8700 2150
Wire Wire Line
	8700 2150 8700 2050
Connection ~ 8700 2150
Wire Wire Line
	8450 1650 8700 1650
Wire Wire Line
	10100 1750 10100 1500
Wire Wire Line
	10100 1500 10450 1500
Wire Wire Line
	10450 2100 10100 2100
Wire Wire Line
	10100 2100 10100 1850
Wire Wire Line
	9300 1750 9150 1750
Text Label 7050 4500 0    39   ~ 0
TEMP2_IN
$Comp
L hc-sr04:HC-SR04 WATER_LEVEL_SENSOR1
U 1 1 5AD8D844
P 5250 2000
F 0 "WATER_LEVEL_SENSOR1" H 5100 2300 39  0000 C CNN
F 1 "HC-SR04" H 5100 1700 39  0000 C CNN
F 2 "" H 5250 2000 60  0001 C CNN
F 3 "" H 5250 2000 60  0000 C CNN
	1    5250 2000
	1    0    0    -1  
$EndComp
$Comp
L espresso-on-crack-rescue:Conn_01x04 WL_WIRE1
U 1 1 5AD8E535
P 5850 1950
F 0 "WL_WIRE1" H 5850 2150 39  0000 C CNN
F 1 "Conn_01x04" H 5850 1650 39  0000 C CNN
F 2 "" H 5850 1950 50  0001 C CNN
F 3 "" H 5850 1950 50  0001 C CNN
	1    5850 1950
	1    0    0    -1  
$EndComp
$Comp
L espresso-on-crack-rescue:Conn_01x04 WL_CONN1
U 1 1 5AD8E615
P 6300 1950
F 0 "WL_CONN1" H 6300 2150 39  0000 C CNN
F 1 "Conn_01x04" H 6300 1650 39  0000 C CNN
F 2 "Pin_Headers:Pin_Header_Straight_1x04_Pitch2.54mm" H 6300 1950 50  0001 C CNN
F 3 "" H 6300 1950 50  0001 C CNN
	1    6300 1950
	-1   0    0    -1  
$EndComp
Wire Wire Line
	5650 1850 5450 1850
Wire Wire Line
	5650 1950 5450 1950
Wire Wire Line
	5650 2050 5450 2050
Wire Wire Line
	5650 2150 5450 2150
$Comp
L power:GNDD #PWR021
U 1 1 5AD8EE19
P 7000 2150
F 0 "#PWR021" H 7000 1900 50  0001 C CNN
F 1 "GNDD" H 7000 2025 50  0000 C CNN
F 2 "" H 7000 2150 50  0001 C CNN
F 3 "" H 7000 2150 50  0001 C CNN
	1    7000 2150
	1    0    0    -1  
$EndComp
Wire Wire Line
	6500 2150 7000 2150
Text Label 6500 1850 0    39   ~ 0
MBED_VU
Text Label 6500 1950 0    39   ~ 0
WL_TRIG_IN
Text Label 6500 2050 0    39   ~ 0
WL_ECHO_IN
Text Label 7050 4700 0    39   ~ 0
WL_TRIG_IN
Text Label 7050 4800 0    39   ~ 0
WL_ECHO_IN
Text Label 8450 1650 2    39   ~ 0
TEMP2_IN
Wire Wire Line
	8750 3600 8750 3700
Wire Wire Line
	8750 3700 8750 3800
Wire Wire Line
	8750 4500 8750 4600
Wire Wire Line
	8750 4000 8920 4000
Wire Wire Line
	8750 4000 8750 4500
Wire Wire Line
	9150 2650 9300 2650
Wire Wire Line
	8700 2950 9150 2950
Wire Wire Line
	2400 5800 2400 6800
Wire Wire Line
	2400 5800 2850 5800
Wire Wire Line
	3600 6000 4100 6000
Wire Wire Line
	4000 5450 4000 5700
Wire Wire Line
	3600 5700 3700 5700
Wire Wire Line
	4000 5700 4000 6400
Wire Wire Line
	9150 1850 9300 1850
Wire Wire Line
	8700 2150 9150 2150
Wire Wire Line
	8750 3800 8750 4000
$EndSCHEMATC
