[
  [
    {
      "id": 1,
      "name": "test"
    },
    {
      "id": 2,
      "name": "test2"
    }
  ],
  [
    {
      "id": 3,
      "name": "test3"
    },
    {
      "id": 4,
      "name": "test4"
    }
  ]

]
