{
  "id": "jpa4twns3egy",
  "coin_id": "dogecoin",
  "name": "Dogecoin",
  "market_cap_rank": 6,
  "current_price": "0.329659",
  "total_volume": "3187904346",
  "high_24h": "0.352667",
  "low_24h": "0.320653",
  "price_change_24h_in_currency": "-0.0133011",
  "price_change_percentage_24h": "-3.87832",
  "circulating_supply": "129966822201.332"
}