{
    "web": {
        "client_id": "435036339357-6ag322251uvcr27tqe7jjrfig4j77n6k.apps.googleusercontent.com",
        "project_id": "fsdproj-310918",
        "auth_uri": "https://accounts.google.com/o/oauth2/auth",
        "token_uri": "https://oauth2.googleapis.com/token",
        "auth_provider_x509_cert_url": "https://www.googleapis.com/oauth2/v1/certs",
        "client_secret": "Dzlej-5ba4BQqyAl9LOufCKG"
    }
}