{
    "name": "OptHistoryView_options",
    "required": [],
    "properties": {
        "variable_names": {
            "type": "array"
        },
        "obj_relative": {
            "type": "boolean"
        },
        "obj_min":{
            "type":"number"
        },
        "obj_max":{
            "type":"number"
        }
    },
    "additionalProperties": false,
    "$schema": "http://json-schema.org/draft-04/schema",
    "type": "object"
}
