{
    "name": "QuadApprox_options",
    "required": ["function"],
    "properties": {
        "function":{
            "type": "string"
        },
        "func_index":{
        	"type":"integer"
        }
    },
    "additionalProperties": false,
    "$schema": "http://json-schema.org/draft-04/schema",
    "type": "object"
}
