{
    "uuid": "92959a70-3d99-11ea-bf56-f7845310d62d",
    "segment": {
        "uuid": "cafdc3c0-0512-11ea-b4ca-9537c8986419",
        "_description": "New description",
        "_masternode": "NEW_RUNNER_",
        "_name": "dry_run_4",
        "lastedit": "2019:11:09 2:56:34",
        "group": {
            "_buildSettings": "buildsettings.xml",
            "_cmInfo": "disk",
            "_cmURI": "cm:SIM@M_CONF_1",
            "_contextURI": "xmllayer.ant:simconfig.xml",
            "_installsequence": "installsequence.xml",
            "_loadsequence": "loadsequence.xml",
            "_name": "CASTORPOUTINE",
            "_settings": "groupsettings_lab.xml",
            "_workingFolder": "/home/whoami/work/gitlab/castorpoutine/conf/M_CONF_1",
            "_syncStatus": false,
            "uuid": "72bfbd10-02c6-11ea-8b68-257c37f434c4",
            "node": [{
                "uuid": "678520d3-3d99-11ea-bf56-f7845310d62d",
                "_name": "Dry_4",
                "os": "Linux",
                "ip": "10.100.1.123",
                "_title": "RUNNER_NEW_1",
                "_cmInfo": "disk",
                "_cmURI": "RUNNER_NEW@myconfig",
                "_contextURI": "RUNNER_NEW",
                "_install_path": "",
                "_installsequence": "installsequence.xml",
                "_loadsequence": "loadsequence.xml",
                "_settings": "settings.xml",
                "_workingFolder": "/home/whoami/work/gitlab/castorpoutine/conf/M_CONF_1",
                "packageGroup": [{
                    "_name": "PKG_GROUP_1",
                    "uuid": "6a51fc70-3d99-11ea-bf56-f7845310d62d",
                    "package": [{
                        "uuid": "72d40690-3d99-11ea-bf56-f7845310d62d",
                        "_name": "DEFAULT_PKG_2",
                        "_alias": "greentool",
                        "_autoVersionOnDisk": true,
                        "_cmInfo": "git://my_machine:49201/greentool",
                        "_cmURI": "cm:greentool@GLOBAL#0.8.83.0",
                        "_contextURI": "",
                        "_install_path": "Resources/Install",
                        "_installsequence": "",
                        "_loadsequence": "",
                        "_settings": "",
                        "_xmlLayerFile": "DEFAULT_PKG_2_config.xml",
                        "title": "DEFAULT_PKG_2",
                        "fancytreeNodeType": "package",
                        "folder": false,
                        "key": "72d40690-3d99-11ea-bf56-f7845310d62d",
                        "customClass": "fa-file-archive",
                        "packageStatus": "offline"
                    }, {
                        "uuid": "88d14c50-3d99-11ea-bf56-f7845310d62d",
                        "_name": "DEFAULT_PKG_4",
                        "_alias": "greentool",
                        "_autoVersionOnDisk": true,
                        "_cmInfo": "git://my_machine:49201/greentool",
                        "_cmURI": "cm:greentool@GLOBAL#0.8.83.0",
                        "_contextURI": "",
                        "_install_path": "Resources/Install",
                        "_installsequence": "",
                        "_loadsequence": "",
                        "_settings": "",
                        "_xmlLayerFile": "DEFAULT_PKG_4_config.xml",
                        "title": "DEFAULT_PKG_4",
                        "fancytreeNodeType": "package",
                        "folder": false,
                        "key": "88d14c50-3d99-11ea-bf56-f7845310d62d",
                        "customClass": "fa-file-archive",
                        "packageStatus": "offline"
                    }],
                    "packageGroup": [],
                    "folder": true,
                    "data": {
                        "icon": "icons.gif",
                        "isLocked": true
                    },
                    "fancytreeNodeType": "packagegroup",
                    "title": "PKG_GROUP_1",
                    "key": "6a51fc70-3d99-11ea-bf56-f7845310d62d",
                    "children": [{
                        "uuid": "72d40690-3d99-11ea-bf56-f7845310d62d",
                        "_name": "DEFAULT_PKG_2",
                        "_alias": "greentool",
                        "_autoVersionOnDisk": true,
                        "_cmInfo": "git://my_machine:49201/greentool",
                        "_cmURI": "cm:greentool@GLOBAL#0.8.83.0",
                        "_contextURI": "",
                        "_install_path": "Resources/Install",
                        "_installsequence": "",
                        "_loadsequence": "",
                        "_settings": "",
                        "_xmlLayerFile": "DEFAULT_PKG_2_config.xml",
                        "title": "DEFAULT_PKG_2",
                        "fancytreeNodeType": "package",
                        "folder": false,
                        "key": "72d40690-3d99-11ea-bf56-f7845310d62d",
                        "customClass": "fa-file-archive",
                        "packageStatus": "offline"
                    }, {
                        "uuid": "88d14c50-3d99-11ea-bf56-f7845310d62d",
                        "_name": "DEFAULT_PKG_4",
                        "_alias": "greentool",
                        "_autoVersionOnDisk": true,
                        "_cmInfo": "git://my_machine:49201/greentool",
                        "_cmURI": "cm:greentool@GLOBAL#0.8.83.0",
                        "_contextURI": "",
                        "_install_path": "Resources/Install",
                        "_installsequence": "",
                        "_loadsequence": "",
                        "_settings": "",
                        "_xmlLayerFile": "DEFAULT_PKG_4_config.xml",
                        "title": "DEFAULT_PKG_4",
                        "fancytreeNodeType": "package",
                        "folder": false,
                        "key": "88d14c50-3d99-11ea-bf56-f7845310d62d",
                        "customClass": "fa-file-archive",
                        "packageStatus": "offline"
                    }],
                    "_syncStatus": false,
                    "nodeStatus": "!",
                    "sshStatus": "!",
                    "httpStatus": "!"
                }],
                "children": [{
                    "_name": "PKG_GROUP_1",
                    "uuid": "6a51fc70-3d99-11ea-bf56-f7845310d62d",
                    "package": [{
                        "uuid": "72d40690-3d99-11ea-bf56-f7845310d62d",
                        "_name": "DEFAULT_PKG_2",
                        "_alias": "greentool",
                        "_autoVersionOnDisk": true,
                        "_cmInfo": "git://my_machine:49201/greentool",
                        "_cmURI": "cm:greentool@GLOBAL#0.8.83.0",
                        "_contextURI": "",
                        "_install_path": "Resources/Install",
                        "_installsequence": "",
                        "_loadsequence": "",
                        "_settings": "",
                        "_xmlLayerFile": "DEFAULT_PKG_2_config.xml",
                        "title": "DEFAULT_PKG_2",
                        "fancytreeNodeType": "package",
                        "folder": false,
                        "key": "72d40690-3d99-11ea-bf56-f7845310d62d",
                        "customClass": "fa-file-archive",
                        "packageStatus": "offline"
                    }, {
                        "uuid": "88d14c50-3d99-11ea-bf56-f7845310d62d",
                        "_name": "DEFAULT_PKG_4",
                        "_alias": "greentool",
                        "_autoVersionOnDisk": true,
                        "_cmInfo": "git://my_machine:49201/greentool",
                        "_cmURI": "cm:greentool@GLOBAL#0.8.83.0",
                        "_contextURI": "",
                        "_install_path": "Resources/Install",
                        "_installsequence": "",
                        "_loadsequence": "",
                        "_settings": "",
                        "_xmlLayerFile": "DEFAULT_PKG_4_config.xml",
                        "title": "DEFAULT_PKG_4",
                        "fancytreeNodeType": "package",
                        "folder": false,
                        "key": "88d14c50-3d99-11ea-bf56-f7845310d62d",
                        "customClass": "fa-file-archive",
                        "packageStatus": "offline"
                    }],
                    "packageGroup": [],
                    "folder": true,
                    "data": {
                        "icon": "icons.gif",
                        "isLocked": true
                    },
                    "fancytreeNodeType": "packagegroup",
                    "title": "PKG_GROUP_1",
                    "key": "6a51fc70-3d99-11ea-bf56-f7845310d62d",
                    "children": [{
                        "uuid": "72d40690-3d99-11ea-bf56-f7845310d62d",
                        "_name": "DEFAULT_PKG_2",
                        "_alias": "greentool",
                        "_autoVersionOnDisk": true,
                        "_cmInfo": "git://my_machine:49201/greentool",
                        "_cmURI": "cm:greentool@GLOBAL#0.8.83.0",
                        "_contextURI": "",
                        "_install_path": "Resources/Install",
                        "_installsequence": "",
                        "_loadsequence": "",
                        "_settings": "",
                        "_xmlLayerFile": "DEFAULT_PKG_2_config.xml",
                        "title": "DEFAULT_PKG_2",
                        "fancytreeNodeType": "package",
                        "folder": false,
                        "key": "72d40690-3d99-11ea-bf56-f7845310d62d",
                        "customClass": "fa-file-archive",
                        "packageStatus": "offline"
                    }, {
                        "uuid": "88d14c50-3d99-11ea-bf56-f7845310d62d",
                        "_name": "DEFAULT_PKG_4",
                        "_alias": "greentool",
                        "_autoVersionOnDisk": true,
                        "_cmInfo": "git://my_machine:49201/greentool",
                        "_cmURI": "cm:greentool@GLOBAL#0.8.83.0",
                        "_contextURI": "",
                        "_install_path": "Resources/Install",
                        "_installsequence": "",
                        "_loadsequence": "",
                        "_settings": "",
                        "_xmlLayerFile": "DEFAULT_PKG_4_config.xml",
                        "title": "DEFAULT_PKG_4",
                        "fancytreeNodeType": "package",
                        "folder": false,
                        "key": "88d14c50-3d99-11ea-bf56-f7845310d62d",
                        "customClass": "fa-file-archive",
                        "packageStatus": "offline"
                    }],
                    "_syncStatus": false,
                    "nodeStatus": "!",
                    "sshStatus": "!",
                    "httpStatus": "!"
                }],
                "sshStatus": "SSH : OK",
                "httpStatus": "HTTP : ONLINE  - idle",
                "title": "Dry_4",
                "fancytreeNodeType": "node",
                "key": "678520d3-3d99-11ea-bf56-f7845310d62d",
                "folder": true,
                "data": {
                    "icon": "icons.gif",
                    "isLocked": true
                },
                "_syncStatus": false,
                "username": "castorpoutine",
                "port": "8084",
                "sshpwd": "!Castor!123",
                "isChanged": true
            }, {
                "uuid": "678520d4-3d99-11ea-bf56-f7845310d62d",
                "_name": "Dry_4_Windows",
                "_title": "RUNNER_NEW 1",
                "os": "Windows",
                "ip": "10.100.1.121",
                "_cmInfo": "disk",
                "_cmURI": "RUNNER_NEW@myconfig",
                "_contextURI": "RUNNER_NEW",
                "_install_path": "",
                "_installsequence": "installsequence.xml",
                "_loadsequence": "loadsequence.xml",
                "_settings": "settings.xml",
                "packageGroup": [],
                "children": [],
                "httpStatus": "HTTP : OFFLINE",
                "title": "Dry_4_Windows",
                "fancytreeNodeType": "node",
                "key": "678520d4-3d99-11ea-bf56-f7845310d62d",
                "folder": true,
                "data": {
                    "icon": "icons.gif",
                    "isLocked": true
                },
                "_syncStatus": false,
                "username": "castorpoutine",
                "port": "8086",
                "sshStatus": "SSH : OFFLINE",
                "sshpwd": "!Castor!123",
                "isChanged": true
            }]
        }
    },
    "isChanged": false
}