{
  "$schema": "../../node_modules/nx/schemas/project-schema.json",
  "sourceRoot": "libs/sstree-pure-js/src",
  "projectType": "library",
  "targets": {
    "lint": {
      "executor": "@nrwl/linter:eslint",
      "outputs": ["{options.outputFile}"],
      "options": {
        "lintFilePatterns": ["libs/sstree-pure-js/**/*.js"]
      }
    },
    "test": {
      "executor": "@nrwl/jest:jest",
      "outputs": ["coverage/libs/sstree-pure-js"],
      "options": {
        "jestConfig": "libs/sstree-pure-js/jest.config.ts",
        "passWithNoTests": true
      }
    }
  },
  "tags": []
}
