[
  {
    "label": "build release",
    "command": "cargo build --release"
  },
  {
    "label": "test",
    "command": "cargo test --workspace"
  },
  {
    "label": "clippy",
    "command": "cargo clippy -Floxrs_core/debug_chunk"
  },
  {
    "label": "run with lox - $ZED_FILENAME",
    "command": "$ZED_WORKTREE_ROOT/target/release/loxrs $ZED_FILE",
    "tags": ["lox-run"]
  }
]
