{
  "root": "libs/dway-heap",
  "sourceRoot": "libs/dway-heap/src",
  "projectType": "library",
  "targets": {
    "lint": {
      "executor": "@nrwl/linter:eslint",
      "outputs": ["{options.outputFile}"],
      "options": {
        "lintFilePatterns": ["libs/dway-heap/**/*.ts"]
      }
    },
    "test": {
      "executor": "@nrwl/jest:jest",
      "outputs": ["coverage/libs/dway-heap"],
      "options": {
        "jestConfig": "libs/dway-heap/jest.config.js",
        "passWithNoTests": true
      }
    }
  },
  "tags": []
}
