{
    "definition":{
       "module":"testing_Arrays",
       "tables":[
          {
             "database":"default",
             "table":"testing_Arrays_trade_FactTable"
          }
       ],
       "facts":[
          "mtf",
          "deltaSpots",
          "riskfactorSpots",
          "mtm",
          "notional"
       ],
       "dimensions":{
          "counterparty":{
             "enumerable":true,
             "folder":"Main",
             "type":"String",
             "anonymize":false,
             "description":"",
             "alias":""
          },
          "tradeDate":{
             "enumerable":true,
             "folder":"Main",
             "type":"Date",
             "anonymize":false,
             "description":"",
             "alias":""
          },
          "counterparty_Group":{
             "enumerable":true,
             "folder":"Main",
             "type":"Default",
             "anonymize":false,
             "description":"",
             "alias":""
          },
          "legIds":{
             "enumerable":true,
             "folder":"Main",
             "type":"Default",
             "anonymize":false,
             "description":"",
             "alias":""
          },
          "testing_Arrays_csa_Dictionary":{
             "enumerable":true,
             "folder":"Main",
             "type":"Default",
             "anonymize":false,
             "description":"",
             "alias":""
          },
          "mtfScenario":{
             "enumerable":true,
             "folder":"Main",
             "type":"String",
             "anonymize":false,
             "description":"",
             "alias":""
          },
          "tradeId":{
             "enumerable":true,
             "folder":"Main",
             "type":"String",
             "anonymize":false,
             "description":"",
             "alias":""
          },
          "riskfactorsLabels":{
             "enumerable":true,
             "folder":"testing_Arrays_riskfactors_ZipTable",
             "type":"Default",
             "anonymize":false,
             "description":"",
             "alias":""
          },
          "legalEntity_Group":{
             "enumerable":true,
             "folder":"Main",
             "type":"Default",
             "anonymize":false,
             "description":"",
             "alias":""
          },
          "elligibleCollateral":{
             "enumerable":true,
             "folder":"testing_Arrays_csa_Dictionary",
             "type":"String",
             "anonymize":false,
             "description":"",
             "alias":""
          },
          "csaId":{
             "enumerable":true,
             "folder":"Main",
             "type":"String",
             "anonymize":false,
             "description":"",
             "alias":""
          },
          "datePlots":{
             "enumerable":true,
             "folder":"testing_Arrays_dateplots_ZipTable",
             "type":"Default",
             "anonymize":false,
             "description":"",
             "alias":""
          },
          "legType":{
             "enumerable":true,
             "folder":"Main",
             "type":"String",
             "anonymize":false,
             "description":"",
             "alias":""
          },
          "book":{
             "enumerable":true,
             "folder":"Main",
             "type":"String",
             "anonymize":false,
             "description":"",
             "alias":""
          },
          "riskfactor_Group":{
             "enumerable":true,
             "folder":"testing_Arrays_riskfactors_ZipTable",
             "type":"Default",
             "anonymize":false,
             "description":"",
             "alias":""
          },
          "productType":{
             "enumerable":true,
             "folder":"testing_Arrays_riskfactors_ZipTable",
             "type":"String",
             "anonymize":false,
             "description":"",
             "alias":""
          },
          "legId":{
             "enumerable":true,
             "folder":"Main",
             "type":"String",
             "anonymize":false,
             "description":"",
             "alias":""
          },
          "collateral_Group":{
             "enumerable":true,
             "folder":"Main",
             "type":"Default",
             "anonymize":false,
             "description":"",
             "alias":""
          },
          "legCurrencies":{
             "enumerable":true,
             "folder":"Main",
             "type":"Default",
             "anonymize":false,
             "description":"",
             "alias":""
          },
          "mta":{
             "enumerable":true,
             "folder":"testing_Arrays_csa_Dictionary",
             "type":"Float32",
             "anonymize":false,
             "description":"",
             "alias":""
          },
          "threshold":{
             "enumerable":true,
             "folder":"testing_Arrays_csa_Dictionary",
             "type":"Float32",
             "anonymize":false,
             "description":"",
             "alias":""
          },
          "legalEntity":{
             "enumerable":true,
             "folder":"Main",
             "type":"String",
             "anonymize":false,
             "description":"",
             "alias":""
          },
          "legalEntities":{
             "enumerable":true,
             "folder":"Main",
             "type":"Default",
             "anonymize":false,
             "description":"",
             "alias":""
          },
          "Date":{
             "enumerable":true,
             "folder":"Main",
             "type":"Default",
             "anonymize":false,
             "description":"",
             "alias":""
          },
          "legTypes":{
             "enumerable":true,
             "folder":"Main",
             "type":"Default",
             "anonymize":false,
             "description":"",
             "alias":""
          },
          "frequency":{
             "enumerable":true,
             "folder":"testing_Arrays_csa_Dictionary",
             "type":"Float32",
             "anonymize":false,
             "description":"",
             "alias":""
          },
          "legCurrency":{
             "enumerable":true,
             "folder":"Main",
             "type":"String",
             "anonymize":false,
             "description":"",
             "alias":""
          },
          "legNotionals":{
             "enumerable":true,
             "folder":"Main",
             "type":"Default",
             "anonymize":false,
             "description":"",
             "alias":""
          }
       },
       "dictionaries":{
          "mta":{
             "database":"default",
             "dict":"testing_Arrays_csa_Dictionary"
          },
          "threshold":{
             "database":"default",
             "dict":"testing_Arrays_csa_Dictionary"
          },
          "frequency":{
             "database":"default",
             "dict":"testing_Arrays_csa_Dictionary"
          },
          "elligibleCollateral":{
             "database":"default",
             "dict":"testing_Arrays_csa_Dictionary"
          }
       },
       "facets":[
          
       ],
       "arrays":[
          {
             "factTable":{
                "database":"default",
                "table":"testing_Arrays_trade_FactTable"
             },
             "label":"riskfactorSpots",
             "zipTable":{
                "database":"default",
                "table":"testing_Arrays_riskfactors_ZipTable"
             },
             "zipLabel":"riskfactorsLabels",
             "joinKeys":[
                {
                   "factLabel":"productType",
                   "zipLabel":"productType"
                }
             ]
          },
          {
             "factTable":{
                "database":"default",
                "table":"testing_Arrays_trade_FactTable"
             },
             "label":"deltaSpots",
             "zipTable":{
                "database":"default",
                "table":"testing_Arrays_riskfactors_ZipTable"
             },
             "zipLabel":"riskfactorsLabels",
             "joinKeys":[
                {
                   "factLabel":"productType",
                   "zipLabel":"productType"
                }
             ]
          },
          {
             "factTable":{
                "database":"default",
                "table":"testing_Arrays_trade_FactTable"
             },
             "label":"mtf",
             "zipTable":{
                "database":"default",
                "table":"testing_Arrays_dateplots_ZipTable"
             },
             "zipLabel":"datePlots",
             "joinKeys":[
                {
                   "factLabel":"mtfScenario",
                   "zipLabel":"mtfScenario"
                }
             ]
          }
       ],
       "arraysDimensions":[
          {
             "dimensions":[
                {
                   "label":"legalEntity",
                   "array":"legalEntities"
                }
             ]
          },
          {
             "dimensions":[
                {
                   "label":"legId",
                   "array":"legIds"
                },
                {
                   "label":"legType",
                   "array":"legTypes"
                },
                {
                   "label":"legCurrency",
                   "array":"legCurrencies"
                }
             ]
          }
       ],
       "settings":{
          "valuesLimit":15000
       }
    },
    "pivots":[
       {
          "module":"testing_Arrays",
          "name":"testing_Arrays_trade_FactTable",
          "metrics":{
             "count_deltaSpots":{
                "function":"countForEach(deltaSpots)",
                "facets":[
                   
                ],
                "currency":null,
                "description":null
             },
             "sum_mtf":{
                "function":"sumForEach(mtf)",
                "facets":[
                   
                ],
                "currency":null,
                "description":null
             },
             "sum_riskfactorSpots":{
                "function":"sumForEach(riskfactorSpots)",
                "facets":[
                   
                ],
                "currency":null,
                "description":null
             },
             "count_mtm":{
                "function":"count(mtm)",
                "facets":[
                   
                ],
                "currency":null,
                "description":null
             },
             "count_notional":{
                "function":"count(notional)",
                "facets":[
                   
                ],
                "currency":null,
                "description":null
             },
             "sum_deltaSpots":{
                "function":"sumForEach(deltaSpots)",
                "facets":[
                   
                ],
                "currency":null,
                "description":null
             },
             "count_riskfactorSpots":{
                "function":"countForEach(riskfactorSpots)",
                "facets":[
                   
                ],
                "currency":null,
                "description":null
             },
             "sum_mtm":{
                "function":"sum(mtm)",
                "facets":[
                   
                ],
                "currency":null,
                "description":null
             },
             "sum_notional":{
                "function":"sum(notional)",
                "facets":[
                   
                ],
                "currency":null,
                "description":null
             },
             "count_mtf":{
                "function":"countForEach(mtf)",
                "facets":[
                   
                ],
                "currency":null,
                "description":null
             }
          },
          "defaultMetric":null,
          "rows":[
             
          ],
          "cols":[
             
          ],
          "dimensions":[
             "counterparty",
             "tradeDate",
             "legIds",
             "book",
             "testing_Arrays_csa_Dictionary",
             "mtfScenario",
             "tradeId",
             "productType",
             "legCurrencies",
             "csaId",
             "legTypes",
             "legNotionals",
             "legalEntities",
             "Date",
             "elligibleCollateral",
             "frequency",
             "mta",
             "threshold",
             "riskfactorsLabels",
             "datePlots",
             "legalEntity",
             "legId",
             "legCurrency",
             "legType",
             "collateral_Group",
             "counterparty_Group",
             "legalEntity_Group",
             "riskfactor_Group"
          ],
          "facts":[
             "mtf",
             "deltaSpots",
             "riskfactorSpots",
             "mtm",
             "notional"
          ],
          "table":{
             "database":"default",
             "table":"testing_Arrays_trade_FactTable"
          },
          "where":{
             "@and":[
                
             ]
          },
          "postaggregkey":[
             
          ],
          "postaggregations":{
             
          }
       }
    ],
    "calculators":[
       
    ],
    "dimensionGroups":[
       {
          "module":"testing_Arrays",
          "name":"collateral_Group",
          "key":"elligibleCollateral",
          "values":{
             "cash":[
                "cash_EUR",
                "cash_GBP"
             ]
          },
          "default":"others"
       },
       {
          "module":"testing_Arrays",
          "name":"riskfactor_Group",
          "key":"riskfactorsLabels",
          "values":{
             "EUR":[
                "EUR1D",
                "EUR1M",
                "EUR1Y"
             ],
             "USD":[
                "USD1D",
                "USD2D"
             ]
          },
          "default":"others"
       },
       {
          "module":"testing_Arrays",
          "name":"counterparty_Group",
          "key":"counterparty",
          "values":{
             "Energy":[
                "Engie",
                "BP",
                "Schell"
             ]
          },
          "default":"others"
       },
       {
          "module":"testing_Arrays",
          "name":"legalEntity_Group",
          "key":"legalEntity",
          "values":{
             "governments":[
                "FR",
                "UK",
                "US"
             ],
             "globalInstitutions":[
                "BCE",
                "FED"
             ]
          },
          "default":"others"
       }
    ],
    "limits":{
       
    },
    "ingestionSettings":[
       {
          "table":{
             "database":"default",
             "table":"testing_Arrays_dateplots_ZipTable"
          },
          "insertQuery":"INSERT INTO default.testing_Arrays_dateplots_ZipTable SELECT mtfScenario, datePlots FROM input('mtfScenario String, datePlots Array(String)')",
          "facts":[
             
          ],
          "facettes":[
             
          ],
          "protobufSchema":null,
          "insertMethod":"Linear",
          "dictionaries":[
             
          ],
          "tableRead":null,
          "tableWrite":null
       },
       {
          "table":{
             "database":"default",
             "table":"testing_Arrays_trade_FactTable"
          },
          "insertQuery":"INSERT INTO default.testing_Arrays_trade_FactTable SELECT ~~as_of~~ Date, ~~dictKey1~~, tradeDate, tradeId, book, counterparty, csaId, productType, mtfScenario, notional, mtm, riskfactorSpots, deltaSpots, mtf, legalEntities, legIds, legCurrencies, legTypes, legNotionals, ~~commit~~, 1, 1, ~~stream_id~~ FROM input('tradeDate Date, tradeId String, book String, counterparty String, csaId String, productType String, mtfScenario String, notional Float32, mtm Float32, riskfactorSpots Array(Float32), deltaSpots Array(Float32), mtf Array(Float32), legalEntities Array(String), legIds Array(String), legCurrencies Array(String), legTypes Array(String), legNotionals Array(Float32)')",
          "facts":[
             "mtf",
             "deltaSpots",
             "riskfactorSpots",
             "mtm",
             "notional"
          ],
          "facettes":[
             
          ],
          "protobufSchema":null,
          "insertMethod":"Linear",
          "dictionaries":[
             {
                "database":"default",
                "dict":"testing_Arrays_csa_Dictionary"
             }
          ],
          "tableRead":null,
          "tableWrite":null
       },
       {
          "table":{
             "database":"default",
             "table":"testing_Arrays_riskfactors_ZipTable"
          },
          "insertQuery":"INSERT INTO default.testing_Arrays_riskfactors_ZipTable SELECT productType, riskfactorsLabels FROM input('productType String, riskfactorsLabels Array(String)')",
          "facts":[
             
          ],
          "facettes":[
             
          ],
          "protobufSchema":null,
          "insertMethod":"Linear",
          "dictionaries":[
             
          ],
          "tableRead":null,
          "tableWrite":null
       },
       {
          "table":{
             "database":"default",
             "table":"testing_Arrays_csa_Dictionary"
          },
          "insertQuery":"INSERT INTO default.testing_Arrays_csa_DictionaryReceiver SELECT ~~as_of~~ Date, csaId, elligibleCollateral, frequency, threshold, mta FROM input('csaId String, elligibleCollateral String, frequency Float32, threshold Float32, mta Float32')",
          "protobufSchema":null,
          "joinKeys":[
             "csaId"
          ],
          "joinTable":{
             "database":"default",
             "dict":"testing_Arrays_csa_DictionaryJoin"
          },
          "idName":"testing_Arrays_csa_Dictionary",
          "dictionaries":[
             
          ],
          "tableRead":null,
          "tableWrite":null
       }
    ],
    "rawDataModel":{
       "tables":[
          {
             "database":"default",
             "name":"testing_Arrays_trade_FactTable",
             "schema":[
                {
                   "name":"tradeDate",
                   "dataType":"Date"
                },
                {
                   "name":"tradeId",
                   "dataType":"String"
                },
                {
                   "name":"book",
                   "dataType":"String"
                },
                {
                   "name":"counterparty",
                   "dataType":"String"
                },
                {
                   "name":"csaId",
                   "dataType":"String"
                },
                {
                   "name":"productType",
                   "dataType":"String"
                },
                {
                   "name":"mtfScenario",
                   "dataType":"String"
                },
                {
                   "name":"notional",
                   "dataType":"Float32"
                },
                {
                   "name":"mtm",
                   "dataType":"Float32"
                },
                {
                   "name":"riskfactorSpots",
                   "dataType":{
                      "Array":{
                         "innerType":"Float32"
                      }
                   }
                },
                {
                   "name":"deltaSpots",
                   "dataType":{
                      "Array":{
                         "innerType":"Float32"
                      }
                   }
                },
                {
                   "name":"mtf",
                   "dataType":{
                      "Array":{
                         "innerType":"Float32"
                      }
                   }
                },
                {
                   "name":"legalEntities",
                   "dataType":{
                      "Array":{
                         "innerType":"String"
                      }
                   }
                },
                {
                   "name":"legIds",
                   "dataType":{
                      "Array":{
                         "innerType":"String"
                      }
                   }
                },
                {
                   "name":"legCurrencies",
                   "dataType":{
                      "Array":{
                         "innerType":"String"
                      }
                   }
                },
                {
                   "name":"legTypes",
                   "dataType":{
                      "Array":{
                         "innerType":"String"
                      }
                   }
                },
                {
                   "name":"legNotionals",
                   "dataType":{
                      "Array":{
                         "innerType":"Float32"
                      }
                   }
                }
             ],
             "unicityKey":[
                "tradeDate",
                "tradeId",
                "book",
                "counterparty",
                "csaId",
                "productType",
                "mtfScenario"
             ],
             "isVersioned":true,
             "tableType":"CanonicalFactTable",
             "partitioningKey":null,
             "primaryKey":null,
             "orderingKey":null,
             "shardingKey":null,
             "ingestionPattern":null,
             "prependDate":true
          },
          {
             "database":"default",
             "name":"testing_Arrays_riskfactors_ZipTable",
             "schema":[
                {
                   "name":"productType",
                   "dataType":"String"
                },
                {
                   "name":"riskfactorsLabels",
                   "dataType":{
                      "Array":{
                         "innerType":"String"
                      }
                   }
                }
             ],
             "unicityKey":null,
             "isVersioned":false,
             "tableType":"CanonicalZipTable",
             "partitioningKey":null,
             "primaryKey":null,
             "orderingKey":null,
             "shardingKey":null,
             "ingestionPattern":null,
             "prependDate":false
          },
          {
             "database":"default",
             "name":"testing_Arrays_dateplots_ZipTable",
             "schema":[
                {
                   "name":"mtfScenario",
                   "dataType":"String"
                },
                {
                   "name":"datePlots",
                   "dataType":{
                      "Array":{
                         "innerType":"String"
                      }
                   }
                }
             ],
             "unicityKey":null,
             "isVersioned":false,
             "tableType":"CanonicalZipTable",
             "partitioningKey":null,
             "primaryKey":null,
             "orderingKey":null,
             "shardingKey":null,
             "ingestionPattern":null,
             "prependDate":false
          },
          {
             "database":"default",
             "name":"testing_Arrays_csa_Dictionary",
             "schema":[
                {
                   "name":"csaId",
                   "dataType":"String"
                },
                {
                   "name":"elligibleCollateral",
                   "dataType":"String"
                },
                {
                   "name":"frequency",
                   "dataType":"Float32"
                },
                {
                   "name":"threshold",
                   "dataType":"Float32"
                },
                {
                   "name":"mta",
                   "dataType":"Float32"
                }
             ],
             "unicityKey":null,
             "isVersioned":false,
             "tableType":"CanonicalDictTable",
             "partitioningKey":null,
             "primaryKey":null,
             "orderingKey":null,
             "shardingKey":null,
             "ingestionPattern":null,
             "prependDate":false
          }
       ],
       "facts":[
          {
             "table":"testing_Arrays_trade_FactTable",
             "fact":"mtf",
             "dataType":{
                "Array":{
                   "innerType":"Float32"
                }
             }
          },
          {
             "table":"testing_Arrays_trade_FactTable",
             "fact":"deltaSpots",
             "dataType":{
                "Array":{
                   "innerType":"Float32"
                }
             }
          },
          {
             "table":"testing_Arrays_trade_FactTable",
             "fact":"riskfactorSpots",
             "dataType":{
                "Array":{
                   "innerType":"Float32"
                }
             }
          },
          {
             "table":"testing_Arrays_trade_FactTable",
             "fact":"mtm",
             "dataType":"Float32"
          },
          {
             "table":"testing_Arrays_trade_FactTable",
             "fact":"notional",
             "dataType":"Float32"
          }
       ],
       "joins":[
          {
             "key1":{
                "table":"testing_Arrays_trade_FactTable",
                "key":[
                   "csaId"
                ]
             },
             "key2":{
                "table":"testing_Arrays_csa_Dictionary",
                "key":[
                   "csaId"
                ]
             },
             "keep":true
          }
       ],
       "zips":[
          {
             "array":{
                "table":"testing_Arrays_trade_FactTable",
                "name":"mtf"
             },
             "label":{
                "table":"testing_Arrays_dateplots_ZipTable",
                "name":"datePlots"
             },
             "joinKey":{
                "key1":{
                   "table":"testing_Arrays_trade_FactTable",
                   "key":[
                      "mtfScenario"
                   ]
                },
                "key2":{
                   "table":"testing_Arrays_dateplots_ZipTable",
                   "key":[
                      "mtfScenario"
                   ]
                }
             },
             "generatedLabelTable":null
          },
          {
             "array":{
                "table":"testing_Arrays_trade_FactTable",
                "name":"deltaSpots"
             },
             "label":{
                "table":"testing_Arrays_riskfactors_ZipTable",
                "name":"riskfactorsLabels"
             },
             "joinKey":{
                "key1":{
                   "table":"testing_Arrays_trade_FactTable",
                   "key":[
                      "productType"
                   ]
                },
                "key2":{
                   "table":"testing_Arrays_riskfactors_ZipTable",
                   "key":[
                      "productType"
                   ]
                }
             },
             "generatedLabelTable":null
          },
          {
             "array":{
                "table":"testing_Arrays_trade_FactTable",
                "name":"riskfactorSpots"
             },
             "label":{
                "table":"testing_Arrays_riskfactors_ZipTable",
                "name":"riskfactorsLabels"
             },
             "joinKey":{
                "key1":{
                   "table":"testing_Arrays_trade_FactTable",
                   "key":[
                      "productType"
                   ]
                },
                "key2":{
                   "table":"testing_Arrays_riskfactors_ZipTable",
                   "key":[
                      "productType"
                   ]
                }
             },
             "generatedLabelTable":null
          }
       ],
       "arrayDims":[
          
       ],
       "facets":[
          
       ]
    },
    "creates":[
       {
          "table":"testing_Arrays_dateplots_ZipTable",
          "sqls":[
             "CREATE TABLE IF NOT EXISTS default.testing_Arrays_dateplots_ZipTable ON CLUSTER '{cluster}' (mtfScenario String, datePlots Array(String)) ENGINE = ReplicatedMergeTree('{zoo_prefix}/tables/{shard_oneshard}/testing_Arrays_dateplots_ZipTable', '{host}') PARTITION BY tuple()  ORDER BY tuple()"
          ]
       },
       {
          "table":"testing_Arrays_trade_FactTable",
          "sqls":[
             "CREATE TABLE IF NOT EXISTS default.testing_Arrays_trade_FactTable ON CLUSTER '{cluster}' (Date Date, testing_Arrays_csa_Dictionary UInt64, tradeDate Date, tradeId String, book String, counterparty String, csaId String, productType String, mtfScenario String, notional Float32, mtm Float32, riskfactorSpots Array(Float32), deltaSpots Array(Float32), mtf Array(Float32), legalEntities Array(String), legIds Array(String), legCurrencies Array(String), legTypes Array(String), legNotionals Array(Float32), commit Int64, factor Int8, nb_aggregated UInt64, stream_id Int64) ENGINE = Distributed('{cluster}', default, shard_testing_Arrays_trade_FactTable, rand())",
             "CREATE TABLE IF NOT EXISTS default.shard_testing_Arrays_trade_FactTable ON CLUSTER '{cluster}' (Date Date, testing_Arrays_csa_Dictionary UInt64, tradeDate Date, tradeId String, book String, counterparty String, csaId String, productType String, mtfScenario String, notional Float32, mtm Float32, riskfactorSpots Array(Float32), deltaSpots Array(Float32), mtf Array(Float32), legalEntities Array(String), legIds Array(String), legCurrencies Array(String), legTypes Array(String), legNotionals Array(Float32), commit Int64, factor Int8, nb_aggregated UInt64, stream_id Int64) ENGINE = ReplicatedMergeTree('{zoo_prefix}/tables/{shard}/shard_testing_Arrays_trade_FactTable', '{host}') PARTITION BY tuple()  ORDER BY tuple()"
          ]
       },
       {
          "table":"testing_Arrays_riskfactors_ZipTable",
          "sqls":[
             "CREATE TABLE IF NOT EXISTS default.testing_Arrays_riskfactors_ZipTable ON CLUSTER '{cluster}' (productType String, riskfactorsLabels Array(String)) ENGINE = ReplicatedMergeTree('{zoo_prefix}/tables/{shard_oneshard}/testing_Arrays_riskfactors_ZipTable', '{host}') PARTITION BY tuple()  ORDER BY tuple()"
          ]
       },
       {
          "table":"testing_Arrays_csa_Dictionary",
          "sqls":[
             "CREATE TABLE IF NOT EXISTS default.shard_testing_Arrays_csa_DictionaryData ON CLUSTER '{cluster_oneshard}' (testing_Arrays_csa_Dictionary UInt64, elligibleCollateral String, frequency Float32, threshold Float32, mta Float32) ENGINE = ReplicatedMergeTree('{zoo_prefix}/tables/{shard_oneshard}/shard_testing_Arrays_csa_DictionaryData', '{host}')  ORDER BY (testing_Arrays_csa_Dictionary)",
             "CREATE TABLE IF NOT EXISTS default.shard_testing_Arrays_csa_DictionaryJoin ON CLUSTER '{cluster_oneshard}' (csaId String, Date Date, testing_Arrays_csa_Dictionary UInt64, insertDate DateTime) ENGINE = ReplicatedReplacingMergeTree('{zoo_prefix}/tables/{shard_oneshard}/shard_testing_Arrays_csa_DictionaryJoin', '{host}', insertDate) PARTITION BY Date ORDER BY (metroHash64(csaId, Date))",
             "CREATE TABLE IF NOT EXISTS default.testing_Arrays_csa_DictionaryReceiver ON CLUSTER '{cluster_oneshard}' (Date Date, csaId String, elligibleCollateral String, frequency Float32, threshold Float32, mta Float32) ENGINE = Null",
             "CREATE MATERIALIZED VIEW IF NOT EXISTS default.testing_Arrays_csa_DictionaryInsert ON CLUSTER '{cluster_oneshard}' TO default.shard_testing_Arrays_csa_DictionaryData AS SELECT metroHash64(csaId, elligibleCollateral, frequency, threshold, mta) AS testing_Arrays_csa_Dictionary, elligibleCollateral, frequency, threshold, mta FROM default.testing_Arrays_csa_DictionaryReceiver WHERE testing_Arrays_csa_Dictionary NOT IN (SELECT testing_Arrays_csa_Dictionary FROM default.shard_testing_Arrays_csa_DictionaryData)",
             "CREATE MATERIALIZED VIEW IF NOT EXISTS default.testing_Arrays_csa_DictionaryJoinInsert ON CLUSTER '{cluster_oneshard}' TO default.shard_testing_Arrays_csa_DictionaryJoin AS SELECT csaId, Date, metroHash64(csaId, elligibleCollateral, frequency, threshold, mta) AS testing_Arrays_csa_Dictionary, now() AS insertDate FROM default.testing_Arrays_csa_DictionaryReceiver WHERE (testing_Arrays_csa_Dictionary, csaId, Date) NOT IN (SELECT (testing_Arrays_csa_Dictionary, csaId, Date) FROM default.shard_testing_Arrays_csa_DictionaryJoin)",
             "CREATE DICTIONARY IF NOT EXISTS testing_Arrays_csa_Dictionary ON CLUSTER '{cluster_oneshard}' (testing_Arrays_csa_Dictionary UInt64 INJECTIVE,  elligibleCollateral String DEFAULT 'elligibleCollateral not found', frequency Float32 DEFAULT 0.0, threshold Float32 DEFAULT 0.0, mta Float32 DEFAULT 0.0) PRIMARY KEY testing_Arrays_csa_Dictionary SOURCE(CLICKHOUSE(HOST 'localhost' PORT tcpPort() USER 'default' TABLE 'shard_testing_Arrays_csa_DictionaryData' PASSWORD '' DB 'default' )) LIFETIME(MIN 0 MAX 0) LAYOUT(HASHED())",
             "CREATE DICTIONARY IF NOT EXISTS testing_Arrays_csa_DictionaryJoin ON CLUSTER '{cluster_oneshard}' (csaId String, Date Date, testing_Arrays_csa_Dictionary UInt64 DEFAULT 0) PRIMARY KEY csaId, Date SOURCE(CLICKHOUSE(HOST 'localhost' PORT tcpPort() USER 'default' TABLE 'shard_testing_Arrays_csa_DictionaryJoin' PASSWORD '' DB 'default' )) LIFETIME(MIN 0 MAX 0) LAYOUT(COMPLEX_KEY_HASHED())"
          ]
       }
    ],
    "drops":[
       {
          "table":"testing_Arrays_dateplots_ZipTable",
          "sqls":[
             "DROP TABLE IF EXISTS default.testing_Arrays_dateplots_ZipTable ON CLUSTER '{cluster}'"
          ]
       },
       {
          "table":"testing_Arrays_trade_FactTable",
          "sqls":[
             "DROP TABLE IF EXISTS default.testing_Arrays_trade_FactTable ON CLUSTER '{cluster}'",
             "DROP TABLE IF EXISTS default.shard_testing_Arrays_trade_FactTable ON CLUSTER '{cluster}'"
          ]
       },
       {
          "table":"testing_Arrays_riskfactors_ZipTable",
          "sqls":[
             "DROP TABLE IF EXISTS default.testing_Arrays_riskfactors_ZipTable ON CLUSTER '{cluster}'"
          ]
       },
       {
          "table":"testing_Arrays_csa_Dictionary",
          "sqls":[
             "DROP DICTIONARY IF EXISTS testing_Arrays_csa_Dictionary ON CLUSTER '{cluster_oneshard}'",
             "DROP DICTIONARY IF EXISTS testing_Arrays_csa_DictionaryJoin ON CLUSTER '{cluster_oneshard}'",
             "DROP TABLE IF EXISTS default.testing_Arrays_csa_DictionaryReceiver ON CLUSTER '{cluster_oneshard}'",
             "DROP TABLE IF EXISTS default.testing_Arrays_csa_DictionaryInsert ON CLUSTER '{cluster_oneshard}'",
             "DROP TABLE IF EXISTS default.testing_Arrays_csa_DictionaryJoinInsert ON CLUSTER '{cluster_oneshard}'",
             "DROP TABLE IF EXISTS default.shard_testing_Arrays_csa_DictionaryData ON CLUSTER '{cluster_oneshard}'",
             "DROP TABLE IF EXISTS default.shard_testing_Arrays_csa_DictionaryJoin ON CLUSTER '{cluster_oneshard}'"
          ]
       }
    ],
    "customizer":null
 }