2021-12-02,trade1,book1,Schell,csa1,IR,stressreg,100000,1000,"[11.0,12.0]","[1.0,2.0]","[97.0,194.0,291.0]","['BCE','FED','FR']","['leg3','leg4']","['EUR','AUD']","['put','call']","[2110.0,3120.0]"
2021-12-02,trade2,book1,Engie,csa1,IR,stressreg,300000,3000,"[33.0,36.0,39.0,42.0]","[3.0,6.0,9.0,12.0]","[99.0,198.0,297.0,396.0]","['BCE','FED']","['leg5','leg6','leg7']","['GBP','USD','EUR']","['futureContract','put','call']","[4310.0,5320.0,6330.0]"
2021-12-02,trade3,book1,Schell,csa1,CTY,stressreg,400000,4000,[44.0],[4.0],"[102.0,204.0,306.0,408.0,510.0]","['BCE','FED','FR','UK']","['leg6','leg7','leg8','leg9','leg10']","['USD','EUR','AUD','GBP','USD']","['put','call','futureContract','put','call']","[5410.0,6420.0,7430.0,8440.0,9450.0]"
