{
    "where": {
        "@and": [
            {
                "Date": {
                    "values": [
                        "2021-05-07"
                    ]
                },
                "elligibleCollateral": {
                    "values": [
                        "cash_GBP"
                    ]
                }
            }
        ]
    }
}