{
    "where": {
        "@and": [
            {
                "Date": {
                    "values": [
                        "2021-05-07"
                    ]
                },
                "StaticKey1": {
                    "values": [
                        "trade_1"
                    ]
                }
            }
        ]
    }
}
