2021-12-02,trade1,book2,Schell,csa2,IR,eco,100000,1000,"[11.0,12.0]","[1.0,2.0]","[99.0,198.0,297.0]","['BCE','FED','FR']","['leg3','leg4']","['EUR','AUD']","['put','call']","[2110.0,3120.0]"
2021-12-02,trade1,book2,Schell,csa2,IR,reg,100000,1000,"[11.0,12.0]","[1.0,2.0]","[102.0,204.0,306.0]","['BCE','FED','FR']","['leg3','leg4']","['EUR','AUD']","['put','call']","[2110.0,3120.0]"
2021-12-02,trade1,book2,Schell,csa2,IR,stressreg,100000,1000,"[11.0,12.0]","[1.0,2.0]","[97.0,194.0,291.0]","['BCE','FED','FR']","['leg3','leg4']","['EUR','AUD']","['put','call']","[2110.0,3120.0]"
2021-12-01,trade2,book1,BP,csa3,CTY,eco,200000,2000,"[22.0,24.0]","[2.0,4.0]",[102.0],"['BCE','FED']","['leg4','leg5']","['AUD','GBP']","['call','futureContract']","[3210.0,4220.0]"
2021-12-03,trade3,book1,Engie,csa4,IR,stressreg,300000,3000,"[33.0,36.0,39.0,42.0]","[3.0,6.0,9.0,12.0]","[99.0,198.0,297.0,396.0]","['BCE','FED']","['leg5','leg6','leg7']","['GBP','USD','EUR']","['futureContract','put','call']","[4310.0,5320.0,6330.0]"
2021-12-03,trade3,book1,Engie,csa4,IR,eco,300000,3000,"[33.0,36.0,39.0,42.0]","[3.0,6.0,9.0,12.0]","[102.0,204.0,306.0,408.0]","['BCE','FED']","['leg5','leg6','leg7']","['GBP','USD','EUR']","['futureContract','put','call']","[4310.0,5320.0,6330.0]"
2021-12-03,trade3,book1,Engie,csa4,IR,reg,300000,3000,"[33.0,36.0,39.0,42.0]","[3.0,6.0,9.0,12.0]","[97.0,194.0,291.0,388.0]","['BCE','FED']","['leg5','leg6','leg7']","['GBP','USD','EUR']","['futureContract','put','call']","[4310.0,5320.0,6330.0]"
2021-12-02,trade4,book1,Schell,csa1,CTY,reg,400000,4000,[44.0],[4.0],"[99.0,198.0,297.0,396.0,495.0]","['BCE','FED','FR','UK']","['leg6','leg7','leg8','leg9','leg10']","['USD','EUR','AUD','GBP','USD']","['put','call','futureContract','put','call']","[5410.0,6420.0,7430.0,8440.0,9450.0]"
2021-12-02,trade4,book1,Schell,csa1,CTY,stressreg,400000,4000,[44.0],[4.0],"[102.0,204.0,306.0,408.0,510.0]","['BCE','FED','FR','UK']","['leg6','leg7','leg8','leg9','leg10']","['USD','EUR','AUD','GBP','USD']","['put','call','futureContract','put','call']","[5410.0,6420.0,7430.0,8440.0,9450.0]"
2021-12-01,trade5,book1,BP,csa2,IR,reg,500000,5000,"[55.0,60.0]","[5.0,10.0]",[99.0],['BCE'],"['leg7','leg8','leg9']","['EUR','AUD','GBP']","['call','futureContract','put']","[6510.0,7520.0,8530.0]"
2021-12-01,trade5,book1,BP,csa2,IR,stressreg,500000,5000,"[55.0,60.0]","[5.0,10.0]",[102.0],['BCE'],"['leg7','leg8','leg9']","['EUR','AUD','GBP']","['call','futureContract','put']","[6510.0,7520.0,8530.0]"
2021-12-01,trade5,book1,BP,csa2,IR,eco,500000,5000,"[55.0,60.0]","[5.0,10.0]",[97.0],['BCE'],"['leg7','leg8','leg9']","['EUR','AUD','GBP']","['call','futureContract','put']","[6510.0,7520.0,8530.0]"
2021-12-03,trade6,book1,Engie,csa3,CTY,eco,600000,6000,"[66.0,72.0]","[6.0,12.0]","[99.0,198.0,297.0]","['BCE','FED']","['leg8','leg9','leg10','leg11']","['AUD','GBP','USD','EUR']","['futureContract','put','call','futureContract']","[7610.0,8620.0,9630.0,10640.0]"
2021-12-03,trade6,book1,Engie,csa3,CTY,reg,600000,6000,"[66.0,72.0]","[6.0,12.0]","[102.0,204.0,306.0]","['BCE','FED']","['leg8','leg9','leg10','leg11']","['AUD','GBP','USD','EUR']","['futureContract','put','call','futureContract']","[7610.0,8620.0,9630.0,10640.0]"
2021-12-03,trade6,book1,Engie,csa3,CTY,stressreg,600000,6000,"[66.0,72.0]","[6.0,12.0]","[97.0,194.0,291.0]","['BCE','FED']","['leg8','leg9','leg10','leg11']","['AUD','GBP','USD','EUR']","['futureContract','put','call','futureContract']","[7610.0,8620.0,9630.0,10640.0]"
2021-12-02,trade7,book1,Schell,csa4,IR,reg,700000,7000,"[77.0,84.0]","[7.0,14.0]","[99.0,198.0]","['BCE','FED']","['leg9','leg10','leg11','leg12','leg13','leg14']","['GBP','USD','EUR','AUD','GBP','USD']","['put','call','futureContract','put','call','futureContract']","[8710.0,9720.0,10730.0,11740.0,12750.0,13760.0]"
2021-12-02,trade7,book1,Schell,csa4,IR,stressreg,700000,7000,"[77.0,84.0]","[7.0,14.0]","[102.0,204.0]","['BCE','FED']","['leg9','leg10','leg11','leg12','leg13','leg14']","['GBP','USD','EUR','AUD','GBP','USD']","['put','call','futureContract','put','call','futureContract']","[8710.0,9720.0,10730.0,11740.0,12750.0,13760.0]"
2021-12-01,trade8,book1,BP,csa1,CTY,eco,800000,8000,"[88.0,96.0,104.0]","[8.0,16.0,24.0]",[99.0],"['BCE','FED']","['leg10','leg11','leg12','leg13']","['USD','EUR','AUD','GBP']","['call','futureContract','put','call']","[9810.0,10820.0,11830.0,12840.0]"
2021-12-01,trade8,book1,BP,csa1,CTY,reg,800000,8000,"[88.0,96.0,104.0]","[8.0,16.0,24.0]",[97.0],"['BCE','FED']","['leg10','leg11','leg12','leg13']","['USD','EUR','AUD','GBP']","['call','futureContract','put','call']","[9810.0,10820.0,11830.0,12840.0]"
2021-12-03,trade9,book1,Engie,csa2,IR,stressreg,900000,9000,"[99.0,108.0,117.0]","[9.0,18.0,27.0]","[99.0,198.0,297.0,396.0]","['BCE','FED']","['leg11','leg12','leg13']","['EUR','AUD','GBP']","['futureContract','put','call']","[10910.0,11920.0,12930.0]"
2021-12-02,trade10,book1,Schell,csa3,CTY,stressreg,1000000,10000,[110.0],[10.0],"[99.0,198.0]","['BCE','FED','FR','UK']","['leg12','leg13','leg14','leg15','leg16','leg17']","['AUD','GBP','USD','EUR','AUD','GBP']","['put','call','futureContract','put','call','futureContract']","[12010.0,13020.0,14030.0,15040.0,16050.0,17060.0]"
2021-12-02,trade10,book1,Schell,csa3,CTY,reg,1000000,10000,[110.0],[10.0],"[102.0,204.0]","['BCE','FED','FR','UK']","['leg12','leg13','leg14','leg15','leg16','leg17']","['AUD','GBP','USD','EUR','AUD','GBP']","['put','call','futureContract','put','call','futureContract']","[12010.0,13020.0,14030.0,15040.0,16050.0,17060.0]"
2021-12-02,trade10,book1,Schell,csa3,CTY,eco,1000000,10000,[110.0],[10.0],"[97.0,194.0]","['BCE','FED','FR','UK']","['leg12','leg13','leg14','leg15','leg16','leg17']","['AUD','GBP','USD','EUR','AUD','GBP']","['put','call','futureContract','put','call','futureContract']","[12010.0,13020.0,14030.0,15040.0,16050.0,17060.0]"
2021-12-01,trade11,book1,BP,csa4,IR,reg,1100000,11000,[121.0],[11.0],[99.0],"['BCE','FED']","['leg13','leg14','leg15','leg16','leg17']","['GBP','USD','EUR','AUD','GBP']","['call','futureContract','put','call','futureContract']","[13110.0,14120.0,15130.0,16140.0,17150.0]"
2021-12-01,trade11,book1,BP,csa4,IR,stressreg,1100000,11000,[121.0],[11.0],[102.0],"['BCE','FED']","['leg13','leg14','leg15','leg16','leg17']","['GBP','USD','EUR','AUD','GBP']","['call','futureContract','put','call','futureContract']","[13110.0,14120.0,15130.0,16140.0,17150.0]"
2021-12-01,trade11,book1,BP,csa4,IR,eco,1100000,11000,[121.0],[11.0],[97.0],"['BCE','FED']","['leg13','leg14','leg15','leg16','leg17']","['GBP','USD','EUR','AUD','GBP']","['call','futureContract','put','call','futureContract']","[13110.0,14120.0,15130.0,16140.0,17150.0]"
2021-12-03,trade12,book1,Engie,csa1,CTY,eco,1200000,12000,[132.0],[12.0],"[99.0,198.0,297.0]","['BCE','FED','FR','UK']","['leg14','leg15','leg16','leg17','leg18']","['USD','EUR','AUD','GBP','USD']","['futureContract','put','call','futureContract','put']","[14210.0,15220.0,16230.0,17240.0,18250.0]"
2021-12-03,trade12,book1,Engie,csa1,CTY,reg,1200000,12000,[132.0],[12.0],"[102.0,204.0,306.0]","['BCE','FED','FR','UK']","['leg14','leg15','leg16','leg17','leg18']","['USD','EUR','AUD','GBP','USD']","['futureContract','put','call','futureContract','put']","[14210.0,15220.0,16230.0,17240.0,18250.0]"
2021-12-02,trade13,book1,Schell,csa2,IR,stressreg,1300000,13000,"[143.0,156.0]","[13.0,26.0]",[99.0],"['BCE','FED','FR','UK','US']","['leg15','leg16','leg17','leg18','leg19']","['EUR','AUD','GBP','USD','EUR']","['put','call','futureContract','put','call']","[15310.0,16320.0,17330.0,18340.0,19350.0]"
2021-12-02,trade13,book1,Schell,csa2,IR,reg,1300000,13000,"[143.0,156.0]","[13.0,26.0]",[102.0],"['BCE','FED','FR','UK','US']","['leg15','leg16','leg17','leg18','leg19']","['EUR','AUD','GBP','USD','EUR']","['put','call','futureContract','put','call']","[15310.0,16320.0,17330.0,18340.0,19350.0]"
2021-12-02,trade13,book1,Schell,csa2,IR,eco,1300000,13000,"[143.0,156.0]","[13.0,26.0]",[97.0],"['BCE','FED','FR','UK','US']","['leg15','leg16','leg17','leg18','leg19']","['EUR','AUD','GBP','USD','EUR']","['put','call','futureContract','put','call']","[15310.0,16320.0,17330.0,18340.0,19350.0]"
2021-12-01,trade14,book1,BP,csa3,CTY,reg,1400000,14000,"[154.0,168.0,182.0]","[14.0,28.0,42.0]",[102.0],"['BCE','FED','FR']","['leg16','leg17']","['AUD','GBP']","['call','futureContract']","[16410.0,17420.0]"
2021-12-01,trade14,book1,BP,csa3,CTY,eco,1400000,14000,"[154.0,168.0,182.0]","[14.0,28.0,42.0]",[97.0],"['BCE','FED','FR']","['leg16','leg17']","['AUD','GBP']","['call','futureContract']","[16410.0,17420.0]"
2021-12-03,trade15,book1,Engie,csa4,IR,eco,1500000,15000,[165.0],[15.0],[99.0],"['BCE','FED']","['leg17','leg18','leg19']","['GBP','USD','EUR']","['futureContract','put','call']","[17510.0,18520.0,19530.0]"
2021-12-03,trade15,book1,Engie,csa4,IR,reg,1500000,15000,[165.0],[15.0],[102.0],"['BCE','FED']","['leg17','leg18','leg19']","['GBP','USD','EUR']","['futureContract','put','call']","[17510.0,18520.0,19530.0]"
2021-12-03,trade15,book1,Engie,csa4,IR,stressreg,1500000,15000,[165.0],[15.0],[97.0],"['BCE','FED']","['leg17','leg18','leg19']","['GBP','USD','EUR']","['futureContract','put','call']","[17510.0,18520.0,19530.0]"
2021-12-02,trade16,book1,Schell,csa1,CTY,reg,1600000,16000,"[176.0,192.0,208.0]","[16.0,32.0,48.0]","[99.0,198.0,297.0,396.0,495.0]","['BCE','FED','FR']","['leg18','leg19','leg0']","['USD','EUR','AUD']","['put','call','put']","[18610.0,19620.0,20630.0]"
2021-12-01,trade17,book1,BP,csa2,IR,reg,1700000,17000,"[187.0,204.0,221.0]","[17.0,34.0,51.0]",[99.0],['BCE'],"['leg19','leg0','leg1','leg2','leg3']","['EUR','AUD','GBP','USD','EUR']","['call','put','call','futureContract','put']","[19710.0,20720.0,21730.0,22740.0,23750.0]"
2021-12-01,trade17,book1,BP,csa2,IR,stressreg,1700000,17000,"[187.0,204.0,221.0]","[17.0,34.0,51.0]",[102.0],['BCE'],"['leg19','leg0','leg1','leg2','leg3']","['EUR','AUD','GBP','USD','EUR']","['call','put','call','futureContract','put']","[19710.0,20720.0,21730.0,22740.0,23750.0]"
2021-12-03,trade18,book1,Engie,csa3,CTY,eco,1800000,18000,[198.0],[18.0],[99.0],"['BCE','FED']","['leg0','leg1','leg2','leg3']","['AUD','GBP','USD','EUR']","['put','call','futureContract','put']","[20810.0,21820.0,22830.0,23840.0]"
2021-12-02,trade19,book1,Schell,csa4,IR,reg,1900000,19000,"[209.0,228.0]","[19.0,38.0]",[99.0],"['BCE','FED','FR','UK']","['leg1','leg2','leg3','leg4','leg5']","['GBP','USD','EUR','AUD','GBP']","['call','futureContract','put','call','futureContract']","[21910.0,22920.0,23930.0,24940.0,25950.0]"
2021-12-02,trade19,book1,Schell,csa4,IR,stressreg,1900000,19000,"[209.0,228.0]","[19.0,38.0]",[102.0],"['BCE','FED','FR','UK']","['leg1','leg2','leg3','leg4','leg5']","['GBP','USD','EUR','AUD','GBP']","['call','futureContract','put','call','futureContract']","[21910.0,22920.0,23930.0,24940.0,25950.0]"
2021-12-01,trade20,book1,BP,csa1,CTY,stressreg,2000000,20000,"[220.0,240.0,260.0]","[20.0,40.0,60.0]",[99.0],['BCE'],"['leg2','leg3','leg4','leg5','leg6']","['USD','EUR','AUD','GBP','USD']","['futureContract','put','call','futureContract','put']","[23010.0,24020.0,25030.0,26040.0,27050.0]"
