eliot_id0,template_name1,script_name0,maturity_date3,template_family3,template_sub_family1,fopi8,algorithm1
eliot_id1,template_name7,script_name0,maturity_date6,template_family9,template_sub_family0,fopi1,algorithm4
eliot_id3,template_name0,script_name1,maturity_date7,template_family2,template_sub_family7,fopi4,algorithm5
eliot_id4,template_name6,script_name1,maturity_date2,template_family0,template_sub_family8,fopi5,algorithm2
eliot_id6,template_name0,script_name5,maturity_date2,template_family8,template_sub_family6,fopi8,algorithm5
eliot_id7,template_name1,script_name7,maturity_date9,template_family1,template_sub_family0,fopi4,algorithm4
eliot_id8,template_name9,script_name1,maturity_date6,template_family9,template_sub_family3,fopi6,algorithm8
eliot_id9,template_name1,script_name9,maturity_date6,template_family4,template_sub_family8,fopi7,algorithm6
