{
  "body": {
    "metrics": [
      "sum_Fact"
    ],
    "postaggregaggr": {},
    "with_facet": true,
    "filter_on_query": null,
    "batch": false,
    "batch_description": null,
    "currency": null,
    "pivot": "Facttable",
    "by": [
      "StaticKey1",
      "StaticKey2"
    ],
    "where": {
      "@and": [
        {
          "Date": {
            "values": [
              "2021-05-07"
            ]
          }
        }
      ]
    },
    "branch": "adj_2"
  },
  "expected_response": [
    {
        "StaticKey1": "trade_7",
        "StaticKey2": "Cpty_2",
        "sum_Fact": 70
    },
    {
        "StaticKey1": "trade_4",
        "StaticKey2": "Cpty_3",
        "sum_Fact": 400
    },
    {
        "StaticKey1": "trade_8",
        "StaticKey2": "Cpty_1",
        "sum_Fact": 8
    },
    {
        "StaticKey1": "trade_2",
        "StaticKey2": "Cpty_1",
        "sum_Fact": 2
    },
    {
        "StaticKey1": "trade_5",
        "StaticKey2": "Cpty_3",
        "sum_Fact": 500
    },
    {
        "StaticKey1": "trade_6",
        "StaticKey2": "Cpty_2",
        "sum_Fact": 60
    },
    {
        "StaticKey1": "trade_3",
        "StaticKey2": "Cpty_1",
        "sum_Fact": 3
    },
    {
        "StaticKey1": "trade_9",
        "StaticKey2": "Cpty_1",
        "sum_Fact": 9
    },
    {
        "StaticKey1": "trade_5",
        "StaticKey2": "Cpty_2",
        "sum_Fact": 50
    },
    {
        "StaticKey1": "trade_6",
        "StaticKey2": "Cpty_3",
        "sum_Fact": 600
    },
    {
        "StaticKey1": "trade_1",
        "StaticKey2": "Cpty_1",
        "sum_Fact": 11
    },
    {
        "StaticKey1": "trade_7",
        "StaticKey2": "Cpty_3",
        "sum_Fact": 700
    },
    {
        "StaticKey1": "trade_4",
        "StaticKey2": "Cpty_2",
        "sum_Fact": 40
    },
    {
        "StaticKey1": "trade_2",
        "StaticKey2": "Cpty_2",
        "sum_Fact": 21
    },
    {
        "StaticKey1": "trade_1",
        "StaticKey2": "Cpty_3",
        "sum_Fact": 100
    },
    {
        "StaticKey1": "trade_8",
        "StaticKey2": "Cpty_2",
        "sum_Fact": 80
    },
    {
        "StaticKey1": "trade_7",
        "StaticKey2": "Cpty_1",
        "sum_Fact": 7
    },
    {
        "StaticKey1": "trade_9",
        "StaticKey2": "Cpty_2",
        "sum_Fact": 90
    },
    {
        "StaticKey1": "trade_3",
        "StaticKey2": "Cpty_2",
        "sum_Fact": 31
    },
    {
        "StaticKey1": "trade_6",
        "StaticKey2": "Cpty_1",
        "sum_Fact": 6
    },
    {
        "StaticKey1": "trade_5",
        "StaticKey2": "Cpty_1",
        "sum_Fact": 5
    },
    {
        "StaticKey1": "trade_9",
        "StaticKey2": "Cpty_3",
        "sum_Fact": 900
    },
    {
        "StaticKey1": "trade_3",
        "StaticKey2": "Cpty_3",
        "sum_Fact": 300
    },
    {
        "StaticKey1": "trade_4",
        "StaticKey2": "Cpty_1",
        "sum_Fact": 4
    },
    {
        "StaticKey1": "trade_2",
        "StaticKey2": "Cpty_3",
        "sum_Fact": 200
    },
    {
        "StaticKey1": "trade_8",
        "StaticKey2": "Cpty_3",
        "sum_Fact": 800
    },
    {
        "StaticKey1": "trade_1",
        "StaticKey2": "Cpty_2",
        "sum_Fact": 11
    }
]
}