{
    "metrics": [
        "quantity"
    ],
    "postaggregaggr": {},
    "with_facet": false,
    "filter_on_query": null,
    "batch": false,
    "batch_description": null,
    "currency": null,
    "pivot": "position_pivot",
    "by": [
        "Portfolio",
        "MicroStrategy",
        "Account",
        "Position",
        "Security",
        "BlmSecurityType"
    ],
    "where": {
        "@and": [
            {
                "Date": {
                    "values": [
                        "2020-04-02"
                    ]
                }
            },
            {
                "PortfolioId": {
                    "values": [
                        "1",
                        "50",
                        "100",
                        "150",
                        "200",
                        "250",
                        "300",
                        "350",
                        "400"
                    ]
                }
            }
        ]
    },
    "versioning": [
        {
            "commit": "e2ea1b1843547daec040d625bdaaac5ba077c779d113ed263719c30f5df1cf2c",
            "asOf": "2020-04-02",
            "comment": "test_new"
        }
    ]
}