2021-05-07,trade_1,Cpty_2,book_1,EUR,10
2021-05-07,trade_2,Cpty_2,book_1,EUR,20
2021-05-07,trade_3,Cpty_2,book_1,EUR,30
2021-05-07,trade_4,Cpty_2,book_1,EUR,40
2021-05-07,trade_5,Cpty_2,book_1,EUR,50
2021-05-07,trade_6,Cpty_2,book_1,EUR,60
2021-05-07,trade_7,Cpty_2,book_1,EUR,70
2021-05-07,trade_8,Cpty_2,book_1,EUR,80
2021-05-07,trade_9,Cpty_2,book_1,EUR,90