{
  "body": {
    "metrics": {
        "sum_notional": ["Absolute","Relative"],
        "sum_mtm": ["Absolute","Relative"]
      },
    "pivot": "testing_Arrays_trade_FactTable",
    "by": [
      "book",
      "counterparty",
      "csaId",
      "legalEntities",
      "legCurrencies",
      "legIds",
      "legTypes",
      "mtfScenario",
      "productType",
      "tradeDate",
      "tradeId"
    ],

    "joinkeys": [
      "book",
      "counterparty",
      "csaId",
      "legalEntities",
      "legCurrencies",
      "legIds",
      "legTypes",
      "mtfScenario",
      "productType",
      "tradeDate",
      "tradeId"
    ],
    "where": {
      "@and": [
        {
          "Date": {
            "values": [
              "2021-05-07"
            ]
          }
        }
      ]
    },
    "sourceVersion": {
      "branch": "initial"
    },
    "targetVersion": {
        "branch": "official"
    },
    "diffType": "Full",
    "limit":100,
    "offset": 0,
    "sortBy":[]
  },
  "expected_response": [
    {
        "book": "book2",
        "counterparty": "Schell",
        "csaId": "csa5",
        "legCurrencies": [
            "EUR",
            "AUD"
        ],
        "legIds": [
            "leg3",
            "leg4"
        ],
        "legTypes": [
            "put",
            "call"
        ],
        "legalEntities": [
            "BCE",
            "FED",
            "FR"
        ],
        "mtfScenario": "stressreg",
        "productType": "IR",
        "tradeDate": "2021-12-02",
        "tradeId": "trade4",
        "sum_notional_source": 100000,
        "sum_notional_target": 100002,
        "sum_mtm_source": 1000,
        "sum_mtm_target": 1002,
        "sum_notional_diff": 2,
        "sum_notional_relative_diff": 2e-05,
        "sum_mtm_diff": 2,
        "sum_mtm_relative_diff": 0.002
    },
    {
        "book": "book1",
        "counterparty": "Schell",
        "csaId": "csa1",
        "legCurrencies": [
            "EUR",
            "AUD"
        ],
        "legIds": [
            "leg3",
            "leg4"
        ],
        "legTypes": [
            "put",
            "call"
        ],
        "legalEntities": [
            "BCE",
            "FED",
            "FR"
        ],
        "mtfScenario": "stressreg",
        "productType": "IR",
        "tradeDate": "2021-12-02",
        "tradeId": "trade1",
        "sum_notional_source": 100000,
        "sum_notional_target": 100001,
        "sum_mtm_source": 1000,
        "sum_mtm_target": 1001,
        "sum_notional_diff": 1,
        "sum_notional_relative_diff": 1e-05,
        "sum_mtm_diff": 1,
        "sum_mtm_relative_diff": 0.001
    }
]
}