{
    "metrics": [
        "quantity"
    ],
    "postaggregaggr": {
        
    },
    "with_facet": true,
    "filter_on_query": null,
    "batch": false,
    "batch_description": null,
    "currency": null,
    "pivot": "position_pivot",
    "by": [
        "Security"
    ],
    "where": {
        "@and": [
            {
                "Date": {
                    "values": [
                        "2020-04-02"
                    ]
                }
            }
        ]
    },
    "branch": "official"
}