{
    "mode": "Create",
    "inputData": [
        {
            "tableName": "Facttable",
            "asOf": "2021-05-07",
            "data": {
                "dataCSV": "\"asOf\",\"StaticKey1\",\"StaticKey2\",\"Dim1\",\"Dim2\",\"Fact\"\r\n\"2021-04-27\",\"Key1\",\"Key2\",\"D1\",\"D2\",121742.24758764052\r\n"
            },
            "format": "CSV"
        },
        {
            "tableName": "Dictionary",
            "asOf": "2021-05-07",
            "data": {
                "dataCSV": "\"StaticKey1\",\"StaticKey2\",\"Deco1\",\"Deco2\"\r\n\"Key1\",\"Key2\",\"D1\",\"D2\"\r\n"
            },
            "format": "CSV"
        }
    ],
    "dataModelSpecs": [
        {
            "factTable": "Facttable"
        },
        {
            "table": "Facttable",
            "dateColumn": "asOf"
        },
        {
            "table": "Facttable",
            "unicityKey": [
                "asOf",
                "StaticKey1",
                "StaticKey2"
            ]
        },
        {
            "table": "Facttable",
            "fact": "Fact",
            "dataType": "Float64"
        },
        {
            "key1": {
                "table": "Facttable",
                "key": [
                    "StaticKey1",
                    "StaticKey2"
                ]
            },
            "key2": {
                "table": "Dictionary",
                "key": [
                    "StaticKey1",
                    "StaticKey2"
                ]
            },
            "keep": true
        }
    ]
}