{
  "body": {
    "metrics": [
      "sum_mtm"
    ],
    "postaggregaggr": {},
    "with_facet": true,
    "filter_on_query": null,
    "batch": false,
    "batch_description": null,
    "currency": null,
    "pivot": "testing_Arrays_trade_FactTable",
    "by": [
      "counterparty",
      "elligibleCollateral"
    ],
    "where": {
      "@and": [
        {
          "Date": {
            "values": [
              "2021-05-07"
            ]
          }
        }
      ]
    },
    "branch": "initial"
  },
  "expected_response": [
    {
        "counterparty": "Schell",
        "elligibleCollateral": "elligibleCollateral not found",
        "sum_mtm": 5000
    },
    {
        "counterparty": "Engie",
        "elligibleCollateral": "inventory",
        "sum_mtm": 3000
    },
    {
        "counterparty": "Schell",
        "elligibleCollateral": "cash_GBP",
        "sum_mtm": 10000
    },
    {
        "counterparty": "Engie",
        "elligibleCollateral": "cash_GBP",
        "sum_mtm": 3000
    },
    {
        "counterparty": "Engie",
        "elligibleCollateral": "elligibleCollateral not found",
        "sum_mtm": 3000
    }
]
}