{
  "body": {
    "metrics": [
      "sum_Fact"
    ],
    "postaggregaggr": {},
    "with_facet": true,
    "filter_on_query": null,
    "batch": false,
    "batch_description": null,
    "currency": null,
    "pivot": "Facttable",
    "by": [
      "StaticKey1",
      "StaticKey2",
      "Deco1"
    ],
    "where": {
      "@and": [
        {
          "Date": {
            "values": [
              "2021-05-07"
            ]
          }
        }
      ]
    },
    "branch": "initial"
  },
  "expected_response": [
    {
      "StaticKey1": "trade_1",
      "StaticKey2": "Cpty_1",
      "sum_Fact": 1
    },
    {
        "StaticKey1": "trade_2",
        "StaticKey2": "Cpty_1",
        "sum_Fact": 2
    },
    {
        "StaticKey1": "trade_3",
        "StaticKey2": "Cpty_1",
        "sum_Fact": 3
    },
    {
        "StaticKey1": "trade_1",
        "StaticKey2": "Cpty_2",
        "sum_Fact": 1
    },
    {
        "StaticKey1": "trade_2",
        "StaticKey2": "Cpty_2",
        "sum_Fact": 2
    },
    {
        "StaticKey1": "trade_3",
        "StaticKey2": "Cpty_2",
        "sum_Fact": 3
    },
    {
        "StaticKey1": "trade_1",
        "StaticKey2": "Cpty_3",
        "sum_Fact": 1
    },
    {
        "StaticKey1": "trade_2",
        "StaticKey2": "Cpty_3",
        "sum_Fact": 2
    },
    {
        "StaticKey1": "trade_3",
        "StaticKey2": "Cpty_3",
        "sum_Fact": 3
    }
]
}