{
  "workflowTemplate": "WF_template",
  "table": "testing_Arrays_trade_FactTable",
  "source": "initial",
  "destination": "official",
  "asOf": "2021-05-07",
  "conflictResolution": "incoming",
  "name": "MR adj_1",
  "comment": "adj_1 comment",
  "variables": {"city":"Paris"},
  "other":{
            "adjustmentsType":"exposures",
            "adjustmentsCategory":"market data",
            "adjustmentsRegion":"APAC",
            "adjustmentsRationales":"IBOR curve frozen due to late data update"

  }
}