{
  "body": {
    "metrics": {
        "sum_mtm": ["Absolute","Relative"]
      },
    "pivot": "testing_Arrays_trade_FactTable",
    "by": [
      "book",
      "counterparty"
    ],
    "joinkeys": [
      "book",
      "counterparty"
    ],
    "where": {
      "@and": [
        {
          "Date": {
            "values": [
              "2021-05-07"
            ]
          }
        }
      ]
    },
    "sourceVersion": {
      "branch": "initial"
    },
    "targetVersion": {
        "branch": "official"
    },
    "diffType": "Full",
    "limit":100,
    "offset": 0,
    "sortBy":[]
  },
  "expected_response": [
    {
        "book": "book1",
        "counterparty": "Schell",
        "sum_mtm_source": 5000,
        "sum_mtm_target": 5001,
        "sum_mtm_diff": 1,
        "sum_mtm_relative_diff": 0.0002
    },
    {
        "book": "book2",
        "counterparty": "Schell",
        "sum_mtm_source": 5000,
        "sum_mtm_target": 5002,
        "sum_mtm_diff": 2,
        "sum_mtm_relative_diff": 0.0004
    }
]
}