{
    "mode": "Create",
    "inputData": [
        {
            "tableName": "Facttable_816_1",
            "asOf": "2021-05-07",
            "data": {
                "dataCSV": "\"asOf\",\"Cpty\",\"portfolio\",\"trade\",\"fact\"\r\n\"2021-04-27\",\"Cpty0\",\"portfolio0\",626941,121742.24758764052\r\n"
            },
            "format": "CSV"
        },
        {
            "tableName": "Dictionarytable_816_1",
            "asOf": "2021-05-07",
            "data": {
                "dataCSV": "\"Cpty\",\"portfolio\",\"decoration1\",\"decoration2\"\r\n\"Cpty7\",\"portfolio7\",\"decoration13\",\"decoration21\"\r\n"
            },
            "format": "CSV"
        }
    ],
    "dataModelSpecs": [
        {
            "factTable": "Facttable_816_1"
        },
        {
            "table": "Facttable_816_1",
            "dateColumn": "asOf"
        },
        {
            "table": "Facttable_816_1",
            "unicityKey": [
                "asOf",
                "Cpty",
                "portfolio",
                "trade"
            ]
        },
        {
            "table": "Facttable_816_1",
            "fact": "fact",
            "dataType": "Float64"
        },
        {
            "key1": {
                "table": "Facttable_816_1",
                "key": [
                    "Cpty",
                    "portfolio"
                ]
            },
            "key2": {
                "table": "Dictionarytable_816_1",
                "key": [
                    "Cpty",
                    "portfolio"
                ]
            },
            "keep": true
        }
    ]
}