0B2uHf9YDYSyrPvPsdSKJe0RcKF3,pauline.thomson@ardian.com,true,GU+y+BBudw9vJM7Im8KFJPc5d4NSxqbCrlZdSF+NoDNUnZhsySv91fqUqCAlb9xv6P1BqrCKKBBtXyxsidWlSw==,oKnrKTox5yts7A==,,,,,,,,,,,,,,,,,,,1616577460177,1620981956538,,,,
0EGhLNtyqaSmusAlC9hlfSkknYi2,matthias.breuckmann@ardian.com,true,MSn5OerhUBf/SeLxqAjIkTEX5VRK38IvpOpl693qIEZQCkBa7Usm+y4IkO/BNkwtaflnhWeNx8UJSMJRKfeqjg==,UpS4kL6H6bVjLA==,,,,,,,,,,,,,,,,,,,1620930755428,1620930755428,,,,
0ImS60RLjphZjwqRiKHeHKB1Qg12,leo.marin@ardian.com,true,QM3tSKlXVy59B5DnbU5vrMrvNmzFd/bn2t2DUhNTxf8D4cZcbO/c1fGqaInssU1g37+rR01MGnhXnZDnB5Po4Q==,FY2F/CgOoPuAmg==,,,,,,,,,,,,,,,,,,,1606824800553,1606824800553,,,,
0Q8eXp5rvqebr9PKUKpVFnG9TP13,steven.thomas@ardian.com,true,CCQWHNC7R8rZ6unrl9QgnYg2P//ypcV+sgrJJIqwWJVy9KfhY8UOEnj4VA1rC5ssbHjH2oQt8csZzcEVAQNTKw==,Y4Bi2TfDthrUlA==,,,,,,,,,,,,,,,,,,,1606462386174,1606462386174,,,,
0WrG5B5pJGT0pjCXGUq4giDFO6A2,elimane.ndoye@ardian.com,true,DVgctrNT8Zwlsdd155lF4f/u4wKlDzYtyEyMA2bJ8zwjBwea/dmH7Wh4KJxTL4zOF8ssq8zib2kUxEHg3/al7Q==,Uc7X++HJEEkp/w==,,,,,,,,,,,,,,,,,,,1616708885509,1617002866228,,,,
0awc8gKVmHdUQQ64pNQ1lUPzBZU2,stephan.torra@ardian.com,true,3S1848Tew84+GnHMyV4KzpqaWIYU9o1p6/MWDBZxTgUzd8aQVxU8am+XxAkUIQdzxQbJeFkIa3kgudErutaMiQ==,2x12QqM+d1PcnQ==,,,,,,,,,,,,,,,,,,,1606416718578,1606416729456,,,,
0hhh1wUHw9UZmwaRwxecv0CWtBE3,mathias.burghardt@ardian.com,true,cBDAP09cn+eQfWi8DDn2XCn3GvpHkikkUIMZAVaEjOmQcvQgZ6u+ZLqu6CmcfQnJ0xe4v+QG1tyEKPG2xLsqww==,EOjvWVD2vz81wA==,,,,,,,,,,,,,,,,,,,1621194253912,1621194253912,,,,
0sKL8zhdcfh7Ysiitux66eW2LWG2,mark.wiedenmann@ardian.com,true,NXNRVqQu140AWAn8U3f4Wa7aCevHiwDDPMBM044BrZV2UdelxfhevhsPLZ27X6Ju3EfjDMSO7AwBxT7uGqKg1Q==,5WOd4A8MeWuJ5A==,,,,,,,,,,,,,,,,,,,1606829253280,1622039607472,,,,
0yQDaCHp26SAXIbRfMvxhkIUzZI3,saralucia.diazroa@ardian.com,true,pnQG+rTEuMXDjCLqMLgA9zsK3OkvFIUlOx2sJQ18WcHBAGhX0W/gRqk5+4W3n4LWha2gBNfojlvtk7Ly1kesPw==,tigNSpjdIS0ksw==,,,,,,,,,,,,,,,,,,,1621783371060,1621783371060,,,,
13LDw8W0q8W8xppzAsJn4s9gQoy1,carole.barnay@ardian.com,true,pSWng1cHEOWYeV53yMrIQC4fLW7A5ascMuihLjCEChmSuaAmJp5ZFhWPN0NDIZdMsRLi95Y65CKdWwgtiZst0w==,Z4AWwEVdddDTAw==,,,,,,,,,,,,,,,,,,,1604682251865,1621517147726,,,,
1AuifL79d8TdkMj32OxjaUuKXpH3,claire.guitton@ardian.com,true,lIBLR6FzrOycRBZPbtI2K4S7PLC1PuJ5g8iOLIrPdNkNYfbRxdKHeKI/a1SoGTWhHWuMHPPWrrI/oxBgniL4yw==,TtbJKN7CLZZQaw==,,,,,,,,,,,,,,,,,,,1603346910582,1603347199374,,,,
1jMgowFL22cUhXJve8DXiFcm0k22,mylan.gaillard@ardian.com,true,Dyt9l+3M2y54F/TdfRkx+fWj/8Zd9/4mNDDf8mbhYAMDWWtRcweub93/4FY5510RB0Msotr98T/aJ81nA+BDhA==,vY9rtI3uUWpMSg==,,,,,,,,,,,,,,,,,,,1606990228673,1606990228673,,,,
1kmpKwHo71W8AyGuWTcP0jYkvS43,fanny.lamare@ardian.com,true,KEwS8oIk97j2FcAI9v9zpcMyib07hgO9dlKlTJgNzwWIjXAxkbHmXbamksVce2A9zeWnPFKK8cuQ8IcE3D6fNQ==,VaCE0pZCb3GHOg==,,,,,,,,,,,,,,,,,,,1606982296747,1607027970797,,,,
24Wr6T2AsAUHAO5njlx4H6EiN1b2,erin.odisio.jones@ardian.com,true,iIiy2jupi2J9+6mt/1u8veGS0ntUywJQJSMsD6vC8dwLDwQlhNoUS/XoYgqIszkOTxH3vboO1p7NyMqmvXuK4Q==,0IbOZKEAvjVVpg==,,,,,,,,,,,,,,,,,,,1603390989950,1620961021612,,,,
2NQWZziMlCZ287mZiJvOJ6p9f4I3,apoorva.joshi@ardian.com,true,JboJ5AbwlOVK2SsawBApgh6COziayFwLwNToGUZcxJjL3hQjli+vw9N8PpCVtS7iKcLh0L5Ok7rbqRBwZE8+4Q==,WQFMYxgHd3En7w==,,,,,,,,,,,,,,,,,,,1606826021945,1608133042523,,,,
2Vt5l9e6AnaZzLRDipiIJIF3b373,sara.huang@ardian.com,true,hdkR5WKFwre7tWjdMoCPlFEcWMWHK9sHv0L4ZccsyDJ9mA/yHqY6FGLChvQAvsfev3AhP9bCiwty1xqaT7dj/w==,Rn3Irp6GtcOOqQ==,,,,,,,,,,,,,,,,,,,1616024618452,1621888160614,,,,
2ap2UipfGFemb4TK4E5R97aLYo92,florian.kluge@ardian.com,true,EWxP01t5ifLjX64B6BsoJ2fhljORk4due81Zb6bUv6/lfV2x8KfIbu9KfrWlThp3/XPHVDitcBmG2r/a31n5DQ==,bRRBWMWOaSs3Zg==,,,,,,,,,,,,,,,,,,,1606807980150,1606807980150,,,,
337JaUyFt3a8qnKOKXY8J5f10yT2,anamaria.coric@ardian.com,true,cgOmwQxzJ5o0YO6Paf4Xo17LN3uGB1q4646GsGvvb+kxwHMF9vvGh7SL1QOGNYqcIFc1lIymjEQfMoVSQFi+rQ==,vRgGYqCsAyDpOw==,,,,,,,,,,,,,,,,,,,1603348137395,1619536709309,,,,
3OirvbqDpXYlKkCJXNdx8WdBV7U2,tace.riche@ardian.com,true,jAGTP8N8yk+tJVcO6jEYrZptbZsQtouxSthCTVTcFrzUAOXwkOvayQMsYirRnf4HcwLZYuEbZMgZj6IZSA3grg==,9ph3hOul+PYP6Q==,,,,,,,,,,,,,,,,,,,1606727949743,1607437720835,,,,
3RV1k9SA7nZyQWsUBqMj0N3emft1,olivier.decanniere@ardian.com,true,dNnkZa2TJt/dt7DDuuplFP+Ze2u9mTg6J69k8qr02ynM4HEo/x11kAnZDIfhIr7jN+9aCkzHF0bSZ4AfuOV3/A==,kc7kJwpEbuvlfA==,,,,,,,,,,,,,,,,,,,1606826551210,1606826576120,,,,
3ce0hHeVDYfniGXIL7QmGj6F4eB2,quentin.gautier@ardian.com,true,O1EPl3CMS3Liw03VICFKeS0q+Hb0UKOmtzhrd/QiRv6Wu3zDX6FMDZG4/4qfxqyozyQ7KJQPt2s/GFFK/ZTLug==,RJBnq8+TvcF64w==,,,,,,,,,,,,,,,,,,,1606654777175,1606654777175,,,,
48SZw13JfqMlDn9YgZn8y7RpGFv2,chloe.castillo@ardian.com,true,k8ohTC3B4iirawgjA629JB6EkUWJyie4H8hSIADKOnhz0CvXisw2WCT7Y9O3jtVyRZz+QokrdWQIutp7dDTYbw==,cikMgv9MjiVA5w==,,,,,,,,,,,,,,,,,,,1606932696185,1618475580581,,,,
4ATDt3rCqkXZni1LyRaxONFwSV52,inigo.weston@ardian.com,true,24OXekgzZ3wK4dGYJVyGt8ycoXFLHBT3lz3QwELH+4E4waW8NbFLtQuFROuBgqJF9v6njvWmdpEuWAn9JSCrkQ==,ow7GhI9gx9C68g==,,,,,,,,,,,,,,,,,,,1604419833018,1604419833018,,,,
4AubMQgkpFeDtm3B0Rmfq6rUXKj1,matthew.hill@ardian.com,true,t193js2slk+meeWZ+FS5b4Ox5o6EIw1uXdhE33Qjvo89C2wt2qsaa68eqIdUBdJa+4g0b7tkziWE7j6mKJwFLg==,TNACVFiHQHRgCw==,,,,,,,,,,,,,,,,,,,1603443712061,1603443712061,,,,
4WahZDkW9rWPmL5qsh5dlwPcCZY2,christophe.kuenzler@ardian.com,true,HBKsCUpwaFvFTgHSR7b+Xj6RHYsSAsVTUeI+9FVRBCDD+cMk6hrDhuoxgD+JQP6sI2nbdudMK8PcnQe/Qnf5MQ==,J01hSIRNGH0F0w==,,,,,,,,,,,,,,,,,,,1606730862920,1606937852796,,,,
55AbcsKgrca4Oc6k8SM6wKDKMbz1,romain.wojtowicz@ardian.com,true,qceW/0DrgRF+H7rJW2F7NNuFAcxo+IXa2cRMSAj8YH385o7g2V6VXeWb4N6w7b3h49p+ddtA6ynAORdTPQK+rg==,ZAaRvuzPEs5dAg==,,,,,,,,,,,,,,,,,,,1602712054161,1608225585770,,,,
5ErPbNjDOMPNGnvQpYfSRsPlYCK2,kevin.josel@ardian.com,true,FtZdNnoxxaXGLGnPPNcuXawzPZV32+kWMC1eMGhxSs5nFND0YPGrlT6u7wevVo0zHjEm+794kQsEBhWGAp8exQ==,jFB/nutqwS1c9g==,,,,,,,,,,,,,,,,,,,1606477955509,1606477978564,,,,
5VoFBfuZ8dSgHMcU7thYWpAAkA03,dominique.senequier@ardian.com,true,ILhuJhuaaTqnavEDSTFWAmWqn929HkpE72906X2mpxoIJuxRqHQBs6ndH0imHPurBqe0yH/tZpVciIzfd+HhKg==,yR89QQueAM4dyg==,,,,,,,,,,,,,,,,,,,1604922287701,1621435345555,,,,
5WksWzxtFuTdKVMD9mugFgBq5Sj1,jane.kim@ardian.com,true,VBVyg4oVpCabouU6WmA/aoIpE4fG0SZejp90HMV4tPSFdWBiZM/jCaNaoW8rMlrBPbgIjJ08Cq4Ix+cqoWTlxw==,8zqMcwJvRW01Cg==,,,,,,,,,,,,,,,,,,,1607472119558,1607472119558,,,,
5er2YVJrFrWqZBzk0KB6SxTZhEU2,pierre.klemas@ardian.com,true,eqm207qxxuHYC0gbFf4Md92WMJQe93x6OnpvOefZxuWKKep9ifg/wi5bHNmFPNhQMokbwpnqOQy4esSlWn0CXw==,WM2zLobEP+hfDg==,,,,,,,,,,,,,,,,,,,1606470048135,1606470110803,,,,
5jQrQoktgPMyA2UgReWWYVb5H5U2,amanda.tan@ardian.com,true,+gQ4apezlyncg1Ip+GRRjH6eURdJdbmUaAZEOytb6xJo7+LokS4MzrJvZDq1F/6VkudpHNaCD/+CIiLpyJSFwQ==,aqC7dMD5V2qNVg==,,,,,,,,,,,,,,,,,,,1621476292256,1621476338676,,,,
5k3uMMgviKhzpMMSE9NkfKBjiIl1,daryl.li@ardian.com,true,9x9WkQhUAFqdXfDbpsBVVDgnXVJsYy4CkjPqR8xCxEMr28L4dYrpepLrsA0bmfeVINSuvmxwT6O/Bvmv5Lg47g==,PGC79q+nJ/wWrw==,,,,,,,,,,,,,,,,,,,1621863714329,1622127090416,,,,
5pEvYcI0wOaL1shaNhlcibHmwJF3,janphilipp.schmitz@ardian.com,true,A6/PgpWn3zAvYEjPBR3PcsEfhFXBm43C2D32ipyDoUCXbU+BXceSRNxDpUsCYLZE6MjOZQ/jB34jOJJ+3Hu4Yg==,X91WRLv0uzRwvA==,,,,,,,,,,,,,,,,,,,1615146856623,1615146856623,,,,
5tV6SCBZdjYRQVLcOxAkHVtaNx53,francois.pucheu@ardian.com,true,pTb32c8fep9zPGAq2AnJoBd0SUl9jqOSx7vJ83rvSDc6zNaj6ajej38HS1BzvW20sd5pj6dozeXqqst/E27tUw==,/n6b4DgN8ZEa3g==,,,,,,,,,,,,,,,,,,,1619203063217,1619509181309,,,,
5uPOlESOWuWkkjadFdbv4CxOHBX2,simo.santavirta@ardian.com,true,RHRblwBI2APmc6ClhqG2ue8pw+ejd8GcwmrNK8AXJiYEF5VEMS8rRfXnNVOHn4TJlF27WeTZsNRPh3BsFahaEQ==,CfY3mRPrz5OYLw==,,,,,,,,,,,,,,,,,,,1606814405247,1606814405247,,,,
5yD3nwGYK6bZZVjUpQqVqO3sBaT2,debra.petrone@ardian.com,true,8gt9aKa+x0UjOnZrcMaYDPiQ5YlQmewliQbOZQQlziptVw8eVOILl6E/EaGzRj2Lu+sc3xzejH6htsbNqpXIjA==,vHOvC9EbQGPbpQ==,,,,,,,,,,,,,,,,,,,1611150591802,1611150591802,,,,
6BNZ0clQ5GhzPaSAWlamxUEPXn42,yann.bak@ardian.com,true,uSEW/vjbjuhEJuErgkTTGLjQN3dL4HAp48VT+FE1V8gnDi0vQ/2db0XCQVQhIejJifIr1nazXu01EcxsmgjVfg==,+t347d2vpAG6PA==,,,,,,,,,,,,,,,,,,,1604521174771,1604521174771,,,,
6ElrDQwzEbUnO1f114LjpOcPb3v1,hugo.bensai@ardian.com,true,HALpXN+hZhS800uvcmyDz33jguNbgylKVsZJKBIKC6aphBwW1QKAl7UAZwaW1rXG9p6rG6JG6sOr3zeO0yH96A==,z7ePYfE3f3Jfrg==,,,,,,,,,,,,,,,,,,,1606568804562,1606568804562,,,,
6JbOr9FXoPhw7wt4C5D3Saniead2,lukas.stepanek@ardian.com,true,oa5XJgsNrRphQH8abigOdF4iL0F601ycw1tLOTftFtJPq5hqIB47bgbyAg4hcLZMPZ8L2jdTl4RffbRx1SD3hA==,ArUdANra+SNMcQ==,,,,,,,,,,,,,,,,,,,1606414952083,1606414952083,,,,
6XXUs8aazhenEw7YEccqoL88ebB2,flavie.jean@ardian.com,true,iKjI+Rf1KpcBV2ivwuycBQYnUy9wo+08jocbXRQCgvatIwoJ0rchj+tJYwAif+rXbq29+WeQ9igUqSOpktA6Jw==,w8B0wEckgn9EZg==,,,,,,,,,,,,,,,,,,,1603369623885,1620747011567,,,,
6gjx0GOMRXY6yERdEsrUerAhmNr2,edmund.eggins@ardian.com,true,aw8ep+dE4oY72EDb4hHu7aYrugnzaNkyUf+twZJ6lpOsiTU5BeY7EqjWXd2v9yLT5jDF8BfCUHekvteiL6+7nA==,5V/ADasMppCkIg==,,,,,,,,,,,,,,,,,,,1606414926259,1606414926259,,,,
6hkOubIvHthoRlhLFdK4ba7n3pM2,maria.stasse@ardian.com,true,vQ0PySGihBdsk/Bmh2z9hB7g0uCu1K8rMPssaTaS26QtJu/mrbnuF3KwMv1gvIAgTjtPXsQRZFYc/a91l2FWdw==,L3EZa8qlwBdiFQ==,,,,,,,,,,,,,,,,,,,1620808549382,1620808549382,,,,
6m5GYyPqQmPmb9gWshAxzobCDf03,florian.lucas@ardian.com,true,Kk6MfvPJTRcYOQHs8KyMH0GSHaZJzWNAH3cQ7G2SGWul0OZBrChGpGub4QW34aqm3HWEkekQJPRIvx/kz0rKzQ==,jwQck/2/mIDdOQ==,,,,,,,,,,,,,,,,,,,1618232852913,1618232852913,,,,
6wqYUBtnCzernwT5r8J1LmJScxu2,gaelle.brouard@ardian.com,true,GnxEdAnRZEWBs7kPy8zrJeP/Xp0q57qhrgmLrovb3TK8SJaL25ltQS6KWGAGh7ovp3H7SgGldzez1Ca/Jf/lzg==,7F90q653XfY8+A==,,,,,,,,,,,,,,,,,,,1606833004411,1606833022191,,,,
7B8lvci6iKSPv6CBgvgNaXLrdte2,maxime.letissier@ardian.com,true,oV0cCoM1P5nZCrlU5D96YYXWFt6CN217vrz3aVy5O5fQ/lVI33VyR9w9wjrG5ERprzAiDMEAilLrMGYsRH7NgQ==,m8KysNKz+QJkig==,,,,,,,,,,,,,,,,,,,1603360542051,1603360542051,,,,
7G5Ill4hKCXQxTtQXBZ77rOB2ED3,aymeric.lepeu@ardian.com,true,BGsyVcWLrwwENuxKFKlKaUvn6Sk2Gyy3YD0BDZWwKs5cBBjrNnkhvGyi2z5IB1+ZHU7WkXpvx2YA8g55lRcAFw==,t8XbS4K4K1kqUQ==,,,,,,,,,,,,,,,,,,,1621862974786,1621864771980,,,,
7RuCKV93LWPOj6lj0gy4YMX3NyH2,william.vanes@ardian.com,true,xDuFZN9dLhoaFd8N7ldC9fEW9fP9tP9J4TD2HyDTfnQ59vLvHZd3jsqpE06RyZmPwN0f//J+L1kyStLYUxuj/g==,aXvDn4fRuNVSoA==,,,,,,,,,,,,,,,,,,,1608141210238,1608141220714,,,,
7SZp5SXwZTXAxWXbJcBUVdN9HL23,manuel.haeusler@ardian.com,true,lwHTPg06zSAeqsTlppfLm8MPZIkgxvUFnrnzKfTEgNHYjkqtYi8p/yQYZoWSeJzAHl6dCB/1fVfzErhaFVV3Vw==,J1dQgJR+DNSdxg==,,,,,,,,,,,,,,,,,,,1607072619006,1607072638519,,,,
7knTjuRV9tZPJMtjDiXEV0Z8c942,pia.straetz@ardian.com,true,fWje3YOYwaqQijT0xQAK9Hjh1Ta9LiIjsL1IIlIq/zXR7JfzvyPRSxJG75IVka9OBS3PC3VzbGitp0hAec4s6g==,YErG6gM+l5iH/w==,,,,,,,,,,,,,,,,,,,1620988667662,1620988667662,,,,
7prQgjy5l8h8XHbASvDBxWi0xLj2,sophie.raynaud@ardian.com,true,sePOC4HQLbmJ9Wx6TM4n0COsuw84ct9iPTujeH1JdAZePRVZlu4v2xg5FD94A2WuUiE8zrR2LawxgT+ZO3ryzQ==,BrDePpz3lyxrCg==,,,,,,,,,,,,,,,,,,,1606474996594,1606474996594,,,,
7ubaT2bPBzWkQAYtKoHiSPCn4Hv1,mark.benedetti@ardian.com,true,E128Gn72DLzZoo4V1y8i62jbetIT9yK9DsZ8/7Y22VjoGgrDzt50XPjhM1ky11oVBHBqxJlHcbAueUu+KkW1ZQ==,HhJCwxdudP5hxQ==,,,,,,,,,,,,,,,,,,,1621560045880,1621560045880,,,,
8Kdn6cvXgEeMIroRNS7mOcaX5853,glenn.richard@ardian.com,true,1GtUcHrwQBjqJbLPIO6Htion5fp2mdzbzhl77YQc34f+hGrcQrSKfbP1tuLMXKz3VktFW6SwECyWB4fmVDyrUg==,0Ua9DWPUqL6cRQ==,,,,,,,,,,,,,,,,,,,1606817190541,1606817190541,,,,
8hxYx10FaidEhXDsX2Abgw5BL8u1,lucas.coleon@ardian.com,true,hleLhozpCcrryMuRaa11Li04wUTK4asRJBMlM/KLeDAz6BDc+Ob4x+w1BnZ64P0lzpEtYD/BigkYeXWvhebw5A==,CDDZEO5P7XL9BA==,,,,,,,,,,,,,,,,,,,1606753521358,1606753521358,,,,
8iJGAOjNcvavc5TKRzbqMUKFsj73,maureen.boulanger@ardian.com,true,pnkEWDpurBhI89xnFv+1lWPPvdHyJ7CK1VvBG7FPyFZP8ldvFd0+Gficj2rrqYwTi3bF5qKlLC/UFACK4dxk1g==,LHeKHclBRwP72Q==,,,,,,,,,,,,,,,,,,,1616683196868,1616747360010,,,,
8wYFErSIJlMCALEbkszCpsrczSe2,gregoire.guinot@ardian.com,true,TdzloHtaUojStBjS0dGuLvhh3eiZV1C6SBoq5jHM94aK935cZj+r6MvynZIXRlhhLqXq4+dnCLgFLdq5kCH7Tg==,KSYSwkY8eFkMeg==,,,,,,,,,,,,,,,,,,,1610463170466,1611252526323,,,,
930YFbjiQGgdXkskLrDXLdXMGHE3,alexandre.boulme@gmail.com,true,70qYzBysk56ZmTsywmlDNPd+MtPpBUvaloB1/y0hgSRxt1481COdAr9thhLp/6kFogC1TIkVCURAn5BmYx5f7Q==,TTxuYS+4bQQOcw==,,,,,,,,,,,,,,,,,,,1607622358190,1622133870792,,,,
96wZ54nBjBUC6mAzTBqUWW2Tbh02,jan.mehlhorn@ardian.com,true,PbwSSjUnJXVMFIJMyV5KecfNvprGobunc7RBvnB5ccnmXcgxn1mfm0EdFlvnw2hJBH8Tz7dVwkGa/t0pDVDIRA==,WBjYQVUjoMaNug==,,,,,,,,,,,,,,,,,,,1621248158727,1621248158727,,,,
9FsYTmGRCoMaZVVbflGZFYxUZfd2,maxime.durieux@ardian.com,true,GRCVSc9iLsREwg6MzqmHfYp8J/cN0kyZ8udZkJSRUf5dk8GUUCEVDQpMFiCDW6DtFfzLQ/rFW5wqKiWP0qkAwA==,ef1Aonue8ryrhg==,,,,,,,,,,,,,,,,,,,1620149344847,1620149362081,,,,
9G3OLXPOmZf9FzJMtiLlbs0JVIP2,benjamin.goussiez@ardian.com,true,glvP8+EvJW2MgijFg5nls4ZHrljlnuN0RIuxEMgULUvCXSkZ5t5aA29hJCAQmMuvwNfZQOJ2Us1YYFCTZ8DYkw==,IjEL69NU5VYQKw==,,,,,,,,,,,,,,,,,,,1606823964378,1606825533893,,,,
9JdoCiyJu1SCVlVlM0Z39EU2ebg1,jonathan.lightman@ardian.com,true,X6MiIL55rwGSK/woQwunWjHqq4jXFP1v3qIeyMLcFCEtEDz4l4UcVQ6e6fHvs9kJIPjmIZePmkrg08Ni+VU5Vw==,gnkXNZZmUpF4Zg==,,,,,,,,,,,,,,,,,,,1616168146092,1616168146092,,,,
9QhFKIgmSlWuhEmyAZ1pWVGUBkH2,xiomara.riveros@ardian.com,true,jmIF/OWXJUntII0F52BekLfAas6JvzXhwUSzTsOWl4vs7NZvnj1ozTn6as6CFW9044dLNC6aH0HRHhr3oDhYQw==,Vh5gj4fdh43BUA==,,,,,,,,,,,,,,,,,,,1606422429028,1606422429028,,,,
9iGPkIKLgpNWbQF6ccvfttT7VCB2,jonathan.baldzuhn@ardian.com,true,y4U9QQNgkT8EPA6a8ADctOcaiWhS5MyH2POplamEV6miG29IFALPepWYcOJ+nysHzGFTP7tzO5urIIi19bAhcQ==,Z1nF5Ae6FMZekw==,,,,,,,,,,,,,,,,,,,1619788607674,1619788607674,,,,
9n3h7TmbDtN8h45PuBtkh3dvb9R2,yassin.outassou@ardian.com,true,cn1Eb9bJjmI5iEGVVUcNbC8SO5L1irLxmRb/2lXWuSXrW5AzcdhNaQ0Gh2eL0cjbrA8kD1o+uqZVXlr02HFu/g==,R5LBxv3YHCMo2w==,,,,,,,,,,,,,,,,,,,1606461578822,1606461578822,,,,
A0CGDG8XT8XqyMHfcL1imeY3J7H3,alexandre.daverdon@ardian.com,true,IxoU/+AxJHmgEkejV9Xjv4L3pWZq/pIAm4eaRDGcN76nSBbbL2kwgBPDUHMzE79NIIoCFwRCE2UcTwJMzAdteQ==,IU8R91D6o3i88Q==,,,,,,,,,,,,,,,,,,,1604921769879,1615380254142,,,,
AMpzc0AbXrScrL4B3cRPXtG2Ibz1,benedikt.wagner@ardian.com,true,Enc55/IW83sx6A5e74VnMK0VaL5OAWrxmG0sXUUU9cIRyA5IV12fK8MgYXnW92gH5RY2HOtR0dzFPy6rxDpKmg==,14WCNImip8MG3A==,,,,,,,,,,,,,,,,,,,1606413942625,1606413942625,,,,
ARoDMKRVGOXoDruEo3OMX9g3E7i2,jessica.athmer@ardian.com,true,LYI4wg4zp2AawNrBUiseZoFy2ghY5sMhw94g6GGteOA3ZqzXkf97Pe5s8Z+d8KVAH+UtvK92dAX1hhUDgMqseA==,YH8BHLD43tHIHQ==,,,,,,,,,,,,,,,,,,,1620291209890,1620291209890,,,,
AWYvSH1OevOzvWAytfvOYbDqHbQ2,pierre-antoine.onfroy@ardian.com,true,J2t2a1CLoGWyjTNrVgpW4E9cmb2g1ZYsPrmOTUtDYmEwOAEEHWVL5+VVABQKpSYelh5O9rHLxppfdMJ5U98SdQ==,k8kiVBegEPwb7A==,,,,,,,,,,,,,,,,,,,1606501073684,1618232530637,,,,
AYMbgXKkWZRYiGJUh83MZxC9QNP2,anita.swierzewskakubis@ardian.com,true,EV2a4MXtvcmbWqR1F9bil9gC/MSeptmufmwQZHUFoUAxcHQUwpCQ13PELIjU4r9Bi2hYiTP33J5NBowjxnQSHA==,9L9fKeNvmULOrA==,,,,,,,,,,,,,,,,,,,1615990447424,1615990447424,,,,
AgvgQGNKVUg7dtaa4t6wQYIQZds2,guillaume.julien@ardian.com,true,QBb6vCl6oburTo2LkYdj99kBIPCDjfkbCLDowukR0LMQ5kPQpPZ9UkSs87b3WS7I/zxb5ZgYh/5TBb9uE0Nlbg==,IdDBy4xdHje0Aw==,,,,,,,,,,,,,,,,,,,1606504402080,1606504402080,,,,
BLoFte2ZCPbnYxnjApcKNurrB1j1,christina.lin@ardian.com,false,ez1wmgvzZeI+24l1XbS87LcANC2w3aAXgjwN2RLwYVO5ObWW2SgusE7LwsFfW2NvxdT8fJMM0ixLnNJC3clQ5w==,jLIFJL2zt2gg6g==,,,,,,,,,,,,,,,,,,,1616402550158,1616402566654,,,,
BYJR7i3LWnRDMEWl3W50qSqeMW62,nicolas.bertrand@ardian.com,true,CAv4vcg8iYMcZWhq2vzWE1Haq6w7r0Ao4So/tJP3DE+Ebys89jo0JIi2pckprnSbk535sQoqfaB+vFbko4p9fw==,FGkiOHUqZz/z1A==,,,,,,,,,,,,,,,,,,,1606398763828,1606758963474,,,,
Bs6S6kkZ1JZYyWRokr5VXasEFNf1,marievictoire.roze@ardian.com,true,3RiD8/yQ59vfHVdRJqRMH1KPllAuadNHKlE/mV2MQ7PSTxOpGIfBYQ8szRH4ULwUMNAs1Hj+3xxmXl4RRI4B4w==,fjBV8Y92i2cGDw==,,,,,,,,,,,,,,,,,,,1606803812639,1606803951442,,,,
C0wFnaNMtXTBxwBtuhUILhuHe9B2,sergio.bravo@ardian.com,true,mA8rr8FJ8PbGtje9nzIGi+CHjRQHuVCj/+aGq+efYlzmGTqwq/1MgBa4mWFl0XC/Siejp9cS8oKtdSnf0WUGRw==,o3ry3FN8AsSL9Q==,,,,,,,,,,,,,,,,,,,1606942028148,1606942071471,,,,
CF1F4Qwf9aPFQuUxbD0QnK4tFU33,sylvain.goetz@ardian.com,true,32kOhk6mg3poJc7zq9Ny7eKunHq8EcYoI8ieRp1zvN5DzSMBzHlZ/JiG+ZuJXH5gmZcVEMiSYneF5GVFK0PH3A==,V6S+Don359oBzQ==,,,,,,,,,,,,,,,,,,,1614719630039,1614719630039,,,,
CH9EqFWXvJccyUxRZpyQWl4eXlX2,olivier.personnaz@ardian.com,true,cp7v/Ily8RMXGl4BcLk1UGbgX6Y/4Am2aSmrG/CTwwYgOCoYIjVx0kRsVEr+JiolMVwGqyozIvIXStg3jBD4eA==,NpIUocdzeufXvQ==,,,,,,,,,,,,,,,,,,,1606556511313,1606556511313,,,,
CIu3R6UJHdVF6ogQuqe9WRE7VEG3,vanessa.pitko@ardian.com,true,MSb+GAR4xpNXgSksh6mJR4TRXrlUokngoEBHqOtruBfbO8vXroPcVwsr2FWD6pZYHD3TW3/o0+KyvuM0G36ZNA==,cdA2PNBfdeEyUQ==,,,,,,,,,,,,,,,,,,,1617203956445,1620146650307,,,,
CMzhElTCIMgQ7rAXm9HeCilhLlx1,chris.leboutillier@ardian.com,true,+pFgUSqm109jeu65N+Xz9asSEozbVPOdh5XNv7kAEMgr2BErNoWS34a93m8ZJgIw0eA5uAL3YxT19CYxeYqGKg==,vS3PZBGg+OX0Zw==,,,,,,,,,,,,,,,,,,,1606759113437,1606759113437,,,,
CUKq2IszynVcEjt6abHpxdAUtI83,sebastian.schlabs@ardian.com,true,Kgu9oQm5UYFg6Z1Yeff0ZX90ss4dQKFmrcTd6li24H55WyDGugu/Gdh7nLPfsebnxpvU3pEToxb6+q81ZZDq6g==,5D8JvgAUozGo2Q==,,,,,,,,,,,,,,,,,,,1606418690147,1606418690147,,,,
CkZaCXh7CWSTkTYqXfKwPy2QGfr1,nicolas.kassab@ardian.com,true,2M9yeZd7Od4peq9xcdkTY093LNqpaWHaJQszd5Y6qojis2EJHAf069xMmR1ojJY/FOo3pLplNBtSxTwBQMepGQ==,IT50YBRl7Esa4Q==,,,,,,,,,,,,,,,,,,,1620760874850,1620760874850,,,,
DH72o2tc9UayrnhADtebHxg38F42,beatrice.beitmann@ardian.com,true,QZChHwXj5Mba/XyHSntZxT46ZaRsboNTCpbQOg2NNQZ6NsWRag67EwRPG9cY0PUI3NvGSCCX7URqgM0tEkkrqw==,js2q4fEyVRnEsw==,,,,,,,,,,,,,,,,,,,1606427499314,1606769918374,,,,
DNzKolykFEUHlSIqeTaDuL4ojGI3,zachary.levine@ardian.com,true,96SYThZ7swgxcu+ycdK03CvT2cW/mv74PAZDpIZ5qWPNsCsTmCynwmbBU4xzrlIFFdRXYGBad4f7cFF2fFKl6g==,1Hy1IumsvPMqMw==,,,,,,,,,,,,,,,,,,,1611342282163,1611342282163,,,,
DTsCcJTs8fZXgrndXDbBOyE3JZ43,christopher.sand@ardian.com,true,NwQ3dLHUPpleiWG5j+gmJHOUftaDJ0e9Z0HKg9c9zO1HGVcWFWW1I4xBojU1qVj8b2WePidkjE+cwEJ3NFxN9g==,xhJhqSm5VlnVtQ==,,,,,,,,,,,,,,,,,,,1621945008634,1621945008634,,,,
DVWORWUl9FMZjRlY3pyxMm7HRdq2,sophie.glenat@ardian.com,true,b+mUSckaEIryXt6jl+xzzM906AEuKptNl7EPQf5ieAeggwna9PBlpudGVSuaxxXPemVTBMb1WEQ+7KR+v1ZOLQ==,brRp0isLjv8/cg==,,,,,,,,,,,,,,,,,,,1615806764709,1615806764709,,,,
DzHAiDkrKtV4uqdmrKD6V6RtOkJ2,nacho.lucaya@ardian.com,true,iF8o2bFkVWPS7Effryw5HS6/O0bL34bTM2HI2cCMRaEXXaXsZHdnlCryhaRtNzu5oo1fHWogmGFceuhEpfPENg==,JfA+I4DNFiR1mg==,,,,,,,,,,,,,,,,,,,1606742156176,1606758814548,,,,
EP9Y9NMWqrNPwrKX6GqyWFGFBH13,cristina.arboli@ardian.com,true,jKC97ktwDQ+r7suCMwNsgN024tgP7uIV6nZ3d3fMTojAwhD3FJaWByLK85qr0ogFc6mlSE+pOJqBFcq+Ds0jww==,/Ny+21AscagMmw==,,,,,,,,,,,,,,,,,,,1621431535917,1621431535917,,,,
EuzDKvziKmgV7OjNqjmFhlzECeQ2,delphine.hecquet@ardian.com,true,PpNHV5QrIPjy20aTa5uagtouLOk54AuM3s9gcWeOvBdZbU+X5BgSe2Ly1Tp5z4u21PsIhYR1t5Z3i5KcMC0TtQ==,M0COwA+bkTEk/w==,,,,,,,,,,,,,,,,,,,1603789973724,1603791632021,,,,
EvkoGCvLusMCKsAsVCurDwHQDbH3,thibault.basquin@ardian.com,true,z/WkS4YFvxUDKeECJkmIywd7f+tXBDV7a6ihj7oKrDVSVwCTf44WA3MGiG6f47NSVaVcU61QpfcGgZYk3Sax4g==,ZkicSgCjKHlKeg==,,,,,,,,,,,,,,,,,,,1606438724855,1606438739033,,,,
EyL9I4rHimZaUWBCar6C79GxPE22,lucy.silvestri@ardian.com,true,NmRnkV82j83KHdDXQVzIXTrsCLe5c+Ub9DnELYztEJG1N0TeLKN+jZPj8W50JZQoE5O5Zscx34arPz+OTCHMgg==,ycZCj2H0ryrfew==,,,,,,,,,,,,,,,,,,,1606470995282,1606470995282,,,,
F4PHKt8zchdc8aKlsuxYtMOCCO43,kristian.markov@ardian.com,true,gZ54/AoGQ4QG3x9+4qa1ie7IBjTA5sZT8GsO85VAQlY36cFB0GR2K9EzVeaVcdm8uSv8wg4mnCMU0pM7WH+dog==,o4xJlVrg/DZPFg==,,,,,,,,,,,,,,,,,,,1606825294954,1606839004659,,,,
FOhXIRs3gKbtfeI3VLgNz9U2U3G3,shelini.popat@ardian.com,true,EOsRc+LT6I95Mzs2uN3aHN3TyIMv+S1XT8ffj2RKydzdhl9nBdXMwURmq/vVWvWQ4f9qAyY2b//6xTPj72tPxg==,4UQa2WAvnPYK+w==,,,,,,,,,,,,,,,,,,,1608134681993,1608134681993,,,,
FPIP9FpawAdu9Uh5YdsLsOYrfR93,emilie.tremblay@ardian.com,true,3hDul9dZPIg3QVbVqtC1VmnoA1YMchLUKzE1lYnFSLt4WYZH1bgbArhv6p2HQR2HGfDQI+g57lYRulk9BTTy5Q==,09mzLzsEFXcyRA==,,,,,,,,,,,,,,,,,,,1606818167164,1606818167164,,,,
FSKSjHcSlHMu7Jpe2IUUY1jWRsx1,faruk.amin@ardian.com,true,60qsUVmJk7CylmcdAgBKAUGR+atmczNu2CufAPkSDMuH42899H74DJZYF+XhXZZFp46yIe8vu54ZpLt1KljrIQ==,1vbloIYSgsEEXA==,,,,,,,,,,,,,,,,,,,1606419888468,1621431851421,,,,
FZ0w3Lk1zbYQyskLRFKs8UF2Zu13,gabrielle.philip@ardian.com,true,fX0QmS46UtMBQN+uf/V6REDI0IITVy69XBICYKItGid94VQaAg2+KxxB15g5O8Lk9X8bhY/FYg5V91UBvNQBkg==,yKy5YWJYGlEQ/A==,,,,,,,,,,,,,,,,,,,1621586844664,1621586865841,,,,
FzIP6H3uyFUmwx0oqkKxL6DB1Vc2,elisabetta.bozzoni@ardian.com,true,LqtxOP833cR4EsFFKJQtzpcSRVJB7GEASBOl9zaNrHk1xoECKY0o97uSAldgF4UN5Km54YiFAgJAujWylbJTBQ==,nMggjlTGKShXFA==,,,,,,,,,,,,,,,,,,,1622020446277,1622020446277,,,,
G1vpnotDjkPWRZqe6NcLc8V3izG3,antoine.lindrec@ardian.com,true,OsBfiONS+B1Yo99D938GDUr3p1lkAlllzVYTPJlqzbaLFVzNpQe1/p4TVn059nVwG4rT8gr9B917jIfdKDKHCQ==,UTEkfj0we2mopw==,,,,,,,,,,,,,,,,,,,1606385340800,1614708811852,,,,
G8o4JfdhWUMb7QfITzPd303jN3j1,lynn.hochard@ardian.com,true,83E0Hx43tYzdD39POl3C4xTQlI31Phs4+BFxIcvOxbjlAPwTLbHcPOaB8vDJ5wOL89DY3tEU7X0yRLDD7lO9Lg==,D23tikBnmcSFDg==,,,,,,,,,,,,,,,,,,,1603834804730,1619700025441,,,,
GMSdaMkcs0YvLaZ8HumcVs7piv13,ann-sophie.molter@ardian.com,true,PRMt/We7QzFPcglJ13ld1jJ1SqLtyyRwhajC/WiyLksWOOH/96GQyP273Srec/zvhOuBBbX1VmhJtxUlldyxQA==,LXWzOBIw8dT2Pg==,,,,,,,,,,,,,,,,,,,1606764741527,1606764741527,,,,
GOe23zxBMJRrvIF7rOAbPmD6m8n2,tesfa.abrahaley@ardian.com,true,qJ0tP9HpMaEiYlAr+wEdmgUKWXGFCziUY8YBZsmoOOfrm4DCZ62U8b3lf4syNCykw5Yn/RNd0+nzM0mBjRYaTw==,e8rFZsOJ3a8N8Q==,,,,,,,,,,,,,,,,,,,1606435631353,1606467784948,,,,
GTwVNVPkjDQPUy9pIYWklTDHnPt2,caline.haddad@ardian.com,true,B0zxNVr5i5NT3sHit/5tZZO0Mn/h6Hr0cw62bo5xvxp9ohgl8knaHFHH5hUb9FZILTs/VXzmbXBn1rhsikr0uQ==,dOYCQKH6w0nstA==,,,,,,,,,,,,,,,,,,,1606412306505,1606412559106,,,,
GbYK0RkOUScSnactwinw316Azj03,christelle.grillet@ardian.com,true,epfK9A7QMUVtGYYtOHOVoWTD4YHnB5hfsD3DqCp5CtH5K8Je/nfi5sIqZ/O5lrfJYz67GwNjpXjG1Nudp8CmJg==,J1a/Fh6JNsxTpQ==,,,,,,,,,,,,,,,,,,,1611061578896,1616407574429,,,,
GmKUDhEGtvfxxKAhlb6GKstYlvh2,katherine.ormsby@ardian.com,true,tdoMXv77OPjfBMVu73tKXrN5RfoiUsGl8WxwKGiZMTbi6wzEOKqHt2Cpn1rAemZwksFmcg5ZSRjGnr4j2sG2Pw==,CMXO9XJ98gxAAg==,,,,,,,,,,,,,,,,,,,1606825954587,1606826086130,,,,
GmKVFDoDp5UiDIKFVq1x3AKdvbI2,giorgio.cicala@ardian.com,true,ITzDnA8kReR2H4IYvtooBXiuqu5hRTL4q71kSuSocEaFvn2xaWEhdbmtbvcnITuSvVbkBKRAYatJOADalcNytw==,Xm1xoIJ4b8EtYQ==,,,,,,,,,,,,,,,,,,,1606417301569,1606417301569,,,,
Gvim4xrngzY8AVSdx3d8U7YjLpA3,chloe.tomichedutoit@ardian.com,true,DAFnyLUUG7WTgHvTgCUfA2jZhpVOACoO4/mSGOu6y0OSxq2j3LCutPT+oFHlvALzpfRh5jFMyQdGfaMzW+aJnQ==,fMIilnSgUgv46A==,,,,,,,,,,,,,,,,,,,1620848129757,1620988008545,,,,
H0g7md3vSjhc7GeaKLPOCamVxQ83,jessica.betti@ardian.com,true,yfqOGQLVRv2XpXzFiOM6HP1Ud8So8JptsMVmu64XfLZSoik6HwhyR4N4jcH9rkzuaudS4jV5AXoctYZ7HOAlsg==,pYH7v0bUMQ4FeQ==,,,,,,,,,,,,,,,,,,,1608237608185,1608237840713,,,,
H1PxyRasmugnsO4mT9LlK5HE5e72,vincent.joly@ardian.com,true,ZTPIbQzJ4xvVKDH69/uMtiLa7z/POserkBxIRMRBBQqcWaTwtAfQMHTyFbPVWlNxoxSsEMabBTWsQwt9v3r+vw==,mXKaGYCULYbeFQ==,,,,,,,,,,,,,,,,,,,1606375131396,1606375131396,,,,
HVS307c6SqNQtJacA2Zdjzb85Lf2,florian.haas@ardian.com,true,0yfkfh4Mr1HqSSDL1+7zbRsx9K0gk7CFUvf/eD7p3bdrPvff/adpGFmXo59Vueq/9cw2PuN8Vl39V0fmKwh86g==,dvGGEd9an48KPA==,,,,,,,,,,,,,,,,,,,1606414011150,1606766023758,,,,
He6HesJoMMUENNKEOjAixnOC5jp1,georges.wazen@ardian.com,true,KmCeP8SU2bTlA/mszeRfDMG69ljO5ooEIuPE7ZttIbpMYdpzahMlpHXwu54R6WYVssy45MjEzIX/3SD1ffOSbg==,uTlAZu7cc1S46Q==,,,,,,,,,,,,,,,,,,,1608145706253,1617127790706,,,,
HenIf9k02aQOyCTgt0i7Sw38g2R2,stephanie.langlois@ardian.com,true,WPfFiBOMFO/RDyxqW22j5vTYtifF75NtC/YvuGI1Lbi9mA/cT6X9Fkm3ALK6LL8RcTTb/R6MnZiS1R4QSDbsYw==,UPNZ/rGf1EMEeg==,,,,,,,,,,,,,,,,,,,1606752412848,1606752508288,,,,
HkygxVo94OV572AZuyL0sBjJlmr2,andrea.heyer@ardian.com,true,S4LWmz9gJ43azq/aDzImmHOQs6TTYKFxL5k4s1MejwOF9JVsbNXyhoJ1Z97mLjDsk+BQP+bPjnKV7itawsPfFQ==,KpYKBdtCzCEY/A==,,,,,,,,,,,,,,,,,,,1620403923469,1620403946204,,,,
Hx4irCuSKhT0cEmBusdAqPnj5dt1,benjamin.boller@ardian.com,true,62Q+xZPmkGcBojJnc/9F+Vr7pq2uIERSMegXOHP02vuxN+YDQuiNmx6ai1SDaAsfc7rSCKDDOdJTgYdIOq6uig==,MbLWcKUDt5f8WA==,,,,,,,,,,,,,,,,,,,1606416270740,1606416270740,,,,
I1OAbOqkWjX926gXsLZtZUQkRNu1,chloe.lugon@ardian.com,true,CeS3WtzuJKxcyKN6q66tpZVAw1f5npTUKEf7OP0khP4gTTgJcKF5qm/Rl0iA0vcGfY5nDKHrNL5/fDjvltL1hA==,pmSDe6ZLG0ydjw==,,,,,,,,,,,,,,,,,,,1620032612530,1620032612530,,,,
I1xTlMxRbuYtuq25YF83v9cpBnd2,claire.anderson@ardian.com,true,9nNt1zfaxrsiQKp+NiVg7yBhq6LswOP0lXcjrpO9FBaD9VSm5Tz5x9H21llwzsxf4Mi9UwxqCPjJdzoW3MQp6g==,mNHU8DWMyka0ZQ==,,,,,,,,,,,,,,,,,,,1606698963698,1606698963698,,,,
I9QeF1KfKuUNVkvBssNlUrYgeP93,emilie.leclere@ardian.com,true,zxLp3vPeEKNuBEPb+viyLtM2f7Z4/Futt+rurPlLSI8bzTUd3PO7HCSBKzVXO0gAOtTyDQkf38dHruGn7Gw8UA==,DF5TEivZpPZEgQ==,,,,,,,,,,,,,,,,,,,1606474868214,1606474868214,,,,
IDJDyqKdSRYhC6FwDsI8drZMOPj1,stefano.mion@ardian.com,true,TMum3K4IwNig4lsXB/Dc821nJezJ4h1qxUEMKOdS5pCoX0yA8ZyH9uNKbFoSMuU+Y7DLNysswQIYW4arlUyD+A==,hRuool1Fq2vuFQ==,,,,,,,,,,,,,,,,,,,1606499996003,1606499996003,,,,
IDWatnh7B4UbyngpS2KAz2Xnz3l1,raphaelle.muhlmann-eytan@ardian.com,true,sd8jbfqm3Nz5hAoDTb4ugz3YXwD8zW/OAeQHLx7ixa4dwgYptJnBTGbA2aL4EoiNgP18y9+ORIaMjmFI3t4Y8g==,nPBlOpEc5DD4bw==,,,,,,,,,,,,,,,,,,,1606416047450,1607457908041,,,,
IE0BjWYUDqbE95eKO0WEkjW55D73,thomas.seitz@ardian.com,true,zXcsEa3JACUKTuP8J1F5e0W912liSjef8Go/pMQoDzcmRlQFON2LrcS7g7B+DoqkIZ3AVcpPcjYEOB/ptdu8Xg==,eVngzPfTofPLwQ==,,,,,,,,,,,,,,,,,,,1606385439177,1606385439177,,,,
IHIbTIDyKlPP1oarmXPuafBZZSR2,rosario.mazza@ardian.com,true,V+kkHhNhAZEn32jsD4251cKrno+GUDc2DENeRN6cVoQHhHbudG9Y53IAwH0AZ2SwQQebZyajW2+5Yki9Hqhobg==,Y6TaaO2g7ee3ew==,,,,,,,,,,,,,,,,,,,1606688244626,1622123812399,,,,
IHyI02RN6BMDJaW4t3yiiQuOvqO2,astrid.guebin@ardian.com,true,dr98hkZryVpHx1xud4xGPJh0fVE0o5sA02vgis4+Y765V2hZQokWgaRxE1hRecd6GvP4J0yQG1SDxfO/guz8fQ==,/2Zq2NHxORdt5Q==,,,,,,,,,,,,,,,,,,,1610452583379,1610452583379,,,,
ILbel1lcKSVH22FkJQBzdS2qFtd2,meredith.greenstein@ardian.com,true,swE0YxuA6ydHEweYVA0bWpufsLb5Tf4Phn8Yyln0OD7RsdRuTclTwoWCKSDfYHFIHKvt8TU2dGkPh3cWNk520Q==,WDTp/oPTahWn1Q==,,,,,,,,,,,,,,,,,,,1620743003466,1620743003466,,,,
Ia0vLTjmwfSQTyLJdAIwoK0mxGp2,clotilde.pitadaveiga@ardian.com,true,8Mt3zchNsTeOWvCHx8dSfXvhj4KErJ5ufmgWZLbhyrx2marw/5CVZApZwMtZYZFa/3YCXahbkJWNz+RRYBi9Ww==,Ta+NQuVf44p7WA==,,,,,,,,,,,,,,,,,,,1620981293104,1620981602401,,,,
IvCEX40JANTThxuhw7NC9ZOfHT53,julia.hababou@ardian.com,true,Xqgmvl0SKthhqafidJ8ZRpHkU3dgfSMnBvqfrXxQoejHofkM4YBHIZJsdvxRm8hniiPNFw3L1omwag8QfzBYFg==,bVNbbPYKOWjoww==,,,,,,,,,,,,,,,,,,,1621419540010,1621419540010,,,,
J6cCuRRw9RU9njR1JgPcDi65uFc2,konstantina.roidou@ardian.com,true,qAd1FXTpc1THYvHE4vTmJK4+MT7szn11+tYdRgQM0XwWA13V92uJWU4Ns+B2jXk40eWRCntDxjNdDxhNKprAbA==,Ya7RZJjg1CB+iQ==,,,,,,,,,,,,,,,,,,,1608121630032,1608121630032,,,,
JqXcIs2u4xcxy6pMx6RLmBjHVLC3,philipp.lattermann@ardian.com,true,pOVdQpBgNixaM8jR1KLkO1pi1rEfWmB0gcuGnko8b4+rXKIBG2HgJZ+cGawSp2hYT7oxHVu+PyyC1PY57BY7rw==,UkBbTo4Y4iAKAg==,,,,,,,,,,,,,,,,,,,1606745854801,1606745854801,,,,
JuCAkO8vXiVbR6XAMRe11FGtAgv1,gilles.desoto@ardian.com,true,ybPHqgIvq8GCJy9x18DSoLF/COwm6f3zpVlcX4mS2T2kx3j6bY88iKaG/RSdl6HFxk0g0EmvO4lsrGcii6khpg==,xOJ2eKDTmEaE9Q==,,,,,,,,,,,,,,,,,,,1605604940127,1605604961021,,,,
KOqisObJTzRMjYpoL54R6fXPwZn2,michael.bane@ardian.com,true,cy/TlAWB4OciuJa+0WJCMAHt/2g1KXqp3/oAZ2XZ1ZkEED0sVmNPNOgxZMlh7CO14E1kyre4FWdPUeznfcPbeQ==,Tmdj8yh6I8UeyA==,,,,,,,,,,,,,,,,,,,1606764159523,1606764159523,,,,
KSI7cGqh51W9gCGPLKM9nSHEsa73,jean-baptiste.declercq@ardian.com,true,I6V+b5NKdJP75L9sg5HlafzatR8hjil3V5f6zGIx/rcU7Vi7FX0gFN1rkY0JBeJ6s6ow3Ocdt20I3KWLDgSR7g==,07cpEVz1FujPdg==,,,,,,,,,,,,,,,,,,,1603819089910,1616661501831,,,,
KlWLLwveqIbJYWosB4l10WlPTqU2,oscar.gidali@ardian.com,true,nxBM563Y1BT3XliFTmjmndjItdIpELek3z7jpL4w+Gx7pZQUgXr7NB5HTt3jADKD1jX98rYpUzNaI3YrSzZiyg==,775DED6lb3hqxw==,,,,,,,,,,,,,,,,,,,1622307620145,1622307652837,,,,
KmHJP5udH1hT7cgrmFoSHWR8Bou2,antoine.lencoubareme@ardian.com,true,V8pEoPx2MswLWy/dpp5W8A0kcbVQcFqNdvm8F39bBOhoOYl9CBc+YNhUDoQnZoWnPXY0FwvRMfucIaTVjYm2eg==,K6URI9MxtxpkZQ==,,,,,,,,,,,,,,,,,,,1606821850284,1606823486207,,,,
LBmt4rUc4ASExVbbRQsxr0mpJin2,john.haug@ardian.com,true,ieKvgQf9WzcZqHcF3fHJAHhE6lYrdQMdDufXNJ+BTs08jn3Sl1/W1n3dWCoQHbsO71DXWLvXl/ik6p1YFMJKjg==,g5ct4Gofd2vS2g==,,,,,,,,,,,,,,,,,,,1606758907603,1619380749010,,,,
LJXQsI8imIM2xHID2kSkghqPU8j1,pierre-yves.devriere@ardian.com,true,IeeKdMsXPkbaKqi+PZtgKAdRHjf3be/l2Mt4QuTUOQhN8x087qU+tCmWh09SywQmM10ia0m9N4V7iZ0EAQYyXA==,B6vOP7YY+ajFgQ==,,,,,,,,,,,,,,,,,,,1618232732363,1618232732363,,,,
LQfkHZ31jVXTcfLG1Xsp2gA69HY2,arthur.desalins@ardian.com,true,rYybEuGScPYnW9Gpk0/wQESBupbP+DoGPtLt8LWZGp8WEgSqFut4nHiv7YsFoOhyCBziTcNh1F/+NrzjlsY/9A==,5p4PdS+5qtJynQ==,,,,,,,,,,,,,,,,,,,1608027674460,1609509983945,,,,
La5wWS7XQXM9gWQY4AhVtYM7ces1,nadia.zerguini@ardian.com,true,qKBCMmyw3efeQ7q/lH6l+tXef2uMAcwJNNBzgtTAqhHxLZvs/UIJsAHwbxw/4SWKsdaYoEDXmTtiKiDR0Sz3Gg==,/cdO8xAo7yEngQ==,,,,,,,,,,,,,,,,,,,1606465920255,1609768622956,,,,
LgbKVYgSfVWyLiXClwUEvM9maHv1,erwan.paugam@ardian.com,true,K0qqCcFOAeYeaD/RvccfdxpKbpIOPHFvU7qo/0Aec95mO2MzM1AwGJyjcVvrdSPB6amqjbbuQ891f0KyFv7QFw==,6KhqFpCknKhQiw==,,,,,,,,,,,,,,,,,,,1606730820183,1606730820183,,,,
LodIT4tSeDXKENFraeNjEHT5HS83,derek.rush@ardian.com,true,ledyz5l2fCigUQs27Fj38SesMfjkV6toL4NyXk2u+PEr8TPWtlanHkH4KqIPrpvD6+mCzWdjoumFFaMkBff2ag==,ocNCqs3ndQvpDA==,,,,,,,,,,,,,,,,,,,1615311768323,1615312763036,,,,
LrppkNsWXfTH1DiIjh5VaCAuPup1,benedicte.pretrot@ardian.com,true,Smhr1k2btx8jPvXzrFB2MPCLe7OOSBoYXHWPVsL3C6MFn5gXPnY2TbBuucXBS54+7QHtgkA1/nSA6qfDG5FAeg==,EoD610w6ZiALwg==,,,,,,,,,,,,,,,,,,,1606752046667,1620728795898,,,,
LrrqXtKWTHSFubREBPtontsLH7C2,maxime.casaucau@ardian.com,true,1+g85iyVdXZ6Fjlu13hFBu5Gyi1V104QHadWfmTEvMb1UqS9Zjh78cr6yudUjy561w4jsRP08lhQZ/3+avT9Wg==,EvifnLh3BBq4eA==,,,,,,,,,,,,,,,,,,,1620807747665,1620807747665,,,,
M4hp5owuwFTs10HSObI8bHZNars2,caroline.tarrazi@ardian.com,true,4FSmlC7HumMO5S1NBdjFE6T+miKaErnyJ/Y+VprIRo0GT4Gwgr7AkKo4Dn+EcPeIPJckdtEGszQqAAkFNIdHbg==,MaF0zMFil9oYtw==,,,,,,,,,,,,,,,,,,,1616600487922,1616685535700,,,,
MRyP2arDCiXLGaN7rXYhEPu6cMM2,kilian.barbier@ardian.com,true,gtQxHmekERDkPpyGehLr6lpS5L4o7vJ5vicSc7ZzcgSlJr065iUfXXEtSMEzGwpMT/yTEOWD8uMHqyX/Um84xg==,Nx7IGvUZ64y8QA==,,,,,,,,,,,,,,,,,,,1620984741361,1621003120701,,,,
MomNjahRHKgFgyfnl4z6GR1I72p1,kathryn.gilmore@ardian.com,true,oatF3Omx8iYIkDAIYzgInucFWT8J4rTsMWsnB9ZlwLUr3Q+GaePiqsSMHqcqMLgC5OaZI9NLTwVeOpsXhvMZVQ==,01paOKIbXEIIvg==,,,,,,,,,,,,,,,,,,,1613072615558,1614732431446,,,,
Mqky5yZx0AVPGCtKc4qHhyZYO4J2,anais.robin@ardian.com,true,JtgwroM7P4gD5YCidGfh3yiVuEAsslDsmG4j9mzOK9bRYZca4jIKUVQ448P+Ft7aFph+u3uAEunqaeH97isjYA==,vfQ/uftOhkB9ew==,,,,,,,,,,,,,,,,,,,1603354302108,1620735906375,,,,
Mqy7gkwDEKZbFzMZEn5cUF14mxz1,mark.voccola@ardian.com,true,hpmz9RCFxJQlN6eYTPMnQx7rB7bKFtUWlVaF5hZvMlFKeB65KxxpkV4AsV8z9eWlpEzoF6WU3XwcFfX69UW14w==,WYw2phyy987Q2g==,,,,,,,,,,,,,,,,,,,1621861350319,1621861350319,,,,
Mw8mh9XxEZPg6Vr9MZw02ja3dm93,diallo.cissoko@ardian.com,true,rtuxXXTDKPzftY1sn/ybfkoXD6D/9ifgQfl8n8p4FaRe/bRsa99w22fI4JH3UY30tOIrYfAldrLcBq+JJY0ZLw==,KlB5zhTj4Q7YIA==,,,,,,,,,,,,,,,,,,,1607013746633,1607013746633,,,,
MxHa7L619oaecU3JhBAcptywx0G2,ioannis.amoutzas@ardian.com,true,t4luTAZ6R+Lly2Y7ftBymrSAw5FuV1aeqxDqmeU/2wM8Y+YOwkKZjNs4koAZTIjeOwWef63APYIMdLKA/BiO/g==,784nnPs9yaPBlQ==,,,,,,,,,,,,,,,,,,,1606826138785,1606826138785,,,,
MxWiqBIfQRP8YaZ4VcwGhEtP5fl2,fondationardian@ardian.com,true,fiFvbnS3CQbnC9FUHBa30a4vlA+Oj9/CTIWYdgFdjaWGu7MmNUmz/nTB9QIGS2eq/6/JYTLDh/fUPVEJ+Nik6g==,BAutVww3RmZHEQ==,,,,,,,,,,,,,,,,,,,1606386300255,1622219299830,,,,
N4UvqcwE0MgiXCOEKJgQXpJ7XOu2,alexis.bebear@ardian.com,true,/5LA7MJOg8QIqVBi646ndgxGbphqvVcHKwwxPo9v6QaWmloEjD0yiDGvX5ZWFV8OQVlU6+Ldjp69kOZSDS6cTA==,fl181O3P5rC+Ng==,,,,,,,,,,,,,,,,,,,1607128366643,1607128366643,,,,
N4p6fNtvJeYVaGD1dhPU1gjwXgB2,ross.dexter@ardian.com,true,lFx6j9d5Rx9qIUHbMVHpEF1feGMjx0K6kRQQR8/3okqw36CxxgW85lExOQXsX8PGgyVqMclhyZJH9QauOm1VZA==,Kdm1GgcxLWx4Xg==,,,,,,,,,,,,,,,,,,,1608133448079,1608133448079,,,,
N7Xbi1PV2hUpBNf2KXicjUlPRrE2,jessica.duvivier@ardian.com,true,biMyUBIU1bc/c1CSCqgpF1zAk4vrcITiJEpm9Ja0JQTzybkrvG7nzAO4XO+4JxJ/l1OVF2s24CDh1cdeFCgo3g==,0qGsZCbWmDDKZQ==,,,,,,,,,,,,,,,,,,,1620808023139,1620808063529,,,,
N8xc1sIDHlVFLqjirGAghXGr4ne2,wassila.hda@ardian.com,true,jsAPViTLwJho5oY3gYgSprOz7c7e+eRAUWxSir9pldjOM6P8zW54aTbapF0Vwylk0MuiA7dG2PIAbGTbMBZpXw==,YaBovEMbbDQgfw==,,,,,,,,,,,,,,,,,,,1620720410827,1620993271464,,,,
No4y08vIiGb8YUXGPOY49XB4WeS2,emmanuel.miquel@ardian.com,true,8LdLaUEAWmYtZx+Mi6p+YqQLDLGRQ+XIBZbNrf7bC5BGFr5S4i6XlNE1bPJoYAgAH2HRA5CcWc33fxWu9a9V4A==,XeXklTD9xcCdoA==,,,,,,,,,,,,,,,,,,,1621939149088,1621939149088,,,,
O5E6gcNnMjf9QWTqqVe2tUSvoQr1,sara.angelini@ardian.com,true,EaDh+UwQFlFGHEL73pLHD502WZ5Bs7wQmhakrminuhXpMzu00VoOv1HfG90TOJBhkypsxfCI8f/wsvUBit7I0Q==,l54OTyqdHXQjMA==,,,,,,,,,,,,,,,,,,,1609594231869,1609594231869,,,,
O5zGQ8wrMBNH8n39vKrqBzlRbX02,anna.komarova@ardian.com,true,qTxKwyuWVdAtjgcSmF+AFHrLdNYmQM+vEjn81N7TiSUsw5ZqGr8C0kbt2e06bbTvelW217Ell0CusGBVOXDRAw==,plna50NzTiX9EA==,,,,,,,,,,,,,,,,,,,1606817175014,1606817186114,,,,
OC7ajwUHBqQVPD6sB1kqSoEWTi43,christina.salewski@ardian.com,true,SGgmMQSYf/YZU5O3J85ssgHxr7i6jD/YTR/e4RELWVOk13G8HZBTULvLebDbD0Ky1nn64Ab2XndRxPh9H/c5Sg==,e6eIss9yg8CjEA==,,,,,,,,,,,,,,,,,,,1620142946019,1620142946019,,,,
OT62sIskDxQEwfOfHeglWvFdlbx1,greta.chilelli@ardian.com,true,NXwVAW8DK3cNwxRfc0QowP9M21k3OlHC8x6UVRfw3EhjCjcUWH8EoH1FWiGyCwTeK2A8zwGOfNxQoLBgyYQsYA==,c2uvqkSq5F5yNg==,,,,,,,,,,,,,,,,,,,1606745347287,1606745347287,,,,
OdQLgWTotgUjU9eODh0dIP9hR3I3,delphine.ferre@ardian.com,true,W4b4hNgOiGVhOSHwpAgX5CSSl8733ejKBegkAze7hpEN5+wq8Op0gzp1+lRHlbcAPupBwdoM9817WkJqgB7VkA==,CglIJ9IVD60b2w==,,,,,,,,,,,,,,,,,,,1622018728082,1622018728082,,,,
Oqmxn1NDydgXkzOsD31IekNIcx02,celia.benchimol@ardian.com,true,9iuXQzL1xQvI++KuUXaQHZynpQAEJQSBZLcQudlVvaSFHvECH3pUrEXyRoxstmtzmoeKdlVbQOVU5cWAENVEbg==,sZ00qlZdZOTh5Q==,,,,,,,,,,,,,,,,,,,1606752160577,1606752160577,,,,
P9KmrRq6Zvh9Nk7FecLIQOdofDB3,laura.andremont@ardian.com,true,FCgAdFiQDb035A5HQ1kes0i+WAuR4zkRxDfqmB0xShwPzi1ysOD/CNr0TmXXRSZbjr5mtFmdpEdjQVHaGu4F/A==,eihZTEPhhVQZHw==,,,,,,,,,,,,,,,,,,,1602752715359,1616746273799,,,,
PEZqi1w9kCX651ENwZG2Nl3xOZv2,isabelle.strujan@ardian.com,true,16nZizQKgNPwXwwGqHdcUN5kcWcNFlTkh6rqGRXC5G9JpB1a1/8LN9J5ebMDPNJqFHC1K3npaX4stoQCB4LMlg==,BXCR8Ht+RgLPrw==,,,,,,,,,,,,,,,,,,,1606484019702,1621665089995,,,,
PJJq7kIVTvWYTwlJJPG7NTJLfnc2,arnaud.defollin@ardian.com,true,FFsLTbWThIXXC2HVN4eoSnuLlhb9Uye6FVykehTmDLXhE2MadriFDvtOksUkTVBmvtuPs7fr/FKIAwrz+U5Zaw==,POYZmDaHq0kXsQ==,,,,,,,,,,,,,,,,,,,1611165069807,1611165069807,,,,
PR2zvgv2ORZkBvxOrkoeRo9FmoH2,arnaud.mercier@ardian.com,true,DzUZxbHnR/twBv4tON0n/JC8X+M3+u3FU+7ITQ/I0hIMuxpegnAm0fZO4i0rcTH0CZhKUjLaSGJWjKDfX4WhIA==,Ao84wi2NF2V7sQ==,,,,,,,,,,,,,,,,,,,1611239047154,1612955481484,,,,
PUzXoE5kLIMeHJwJaYALrVkQ4Zv2,frederic.queru@ardian.com,true,JBnlEKNlKgaqhyNcYOr3nwOPcqMriTzNE46uXgU1osJKgaKiOKHx9tne42/bT//EHUIeYZankeryOUvymTt/RQ==,OWHaVkpRor8i0w==,,,,,,,,,,,,,,,,,,,1606475252169,1606475252169,,,,
Peza3pMJ2FbO3NKuBiA4xf7dNIx1,elyssasteinberg@ardian.com,false,ndxMTE3w+Wvda9BQKXvfotAoGf54wobsjKLpEnXbqChsujJUjS8//M8rIKrjQ31+wx9H2CfnkJ/ucoEZbEqqAw==,kjW24dmFHD9/AA==,,,,,,,,,,,,,,,,,,,1606997127378,1606997303546,,,,
Pozl53egw4a2Rwqr4CHODelIC9z2,mackenzie.speak@ardian.com,true,py3PB5zSugA7mxNg7Sk1sEybK2sYSMJdkpxnKuxRXGj9XtTCrpEcdf2GyMmXJWrIaf140FSD1JZvw5U0b2157g==,1mlowcm4k8eMTQ==,,,,,,,,,,,,,,,,,,,1621906456923,1621906456923,,,,
Q4gR6s8Qn1YuQfxQnaMTKU9jhQC2,tamara.krzisch@ardian.com,true,c4dIUnY6mE89YOPttcu/bdOP+C0lJVEerEglHLkeiRxftXwiA1GncinxGZfUAGnAJp58YRuxN1yyOEop2Emm6A==,ndg3jFn+TTp9cQ==,,,,,,,,,,,,,,,,,,,1606502505626,1620840737605,,,,
Q5a2p9tn5HfTQqkIQqdQWsn5Zzy1,farid.masmoudi@ardian.com,true,9omucm6yjVYZpwlhR0ixPWeh5ZE4+FE4TZjjDyn/c2mOKZ8Nn0ZtD5hJo5IAvsOahy0/T7lH0kBYVOvPQC6dnA==,pswFLX18MSkmIw==,,,,,,,,,,,,,,,,,,,1621011252464,1621011252464,,,,
QmNloxh2Yiew4zkGYVWVY2AwFNn2,clement.chidiac@ardian.com,true,zvwgesG+qgyIdb5WED6QaTYQMF14z7ra3+5UCUZ9A0T9q1wlNkHN6RIy2UAZKDdjt3AU6dV5bZ5dYfUFWjD9RQ==,2EtvEV2TWDRaiQ==,,,,,,,,,,,,,,,,,,,1608024297806,1608024297806,,,,
QxovINkf0SSueSTLLLXMLzCzIec2,olivier.berment@ardian.com,true,IUO4h/O6b9POPEjFZEDJWx15zT7lrSYzI8G9KbfuvpZEZbb423DLsBQZG6ArXfdACUwj0/n20ovc7rePx5mYyA==,iWG/C3VnX0P17A==,,,,,,,,,,,,,,,,,,,1606413945419,1606413976889,,,,
RBnK15X45xefm8XaLi8Dfnw440l1,iris.drouillette@ardian.com,false,zXgB53UBEUBhqy9icYyKs0Hlld3JvTJxsw3lnFccO6kzcEcwkIel4Bz7vMQWJ55uyxRL0qYm6F/Z7jEUXGnAsQ==,oydAf0TbgFNvRA==,,,,,,,,,,,,,,,,,,,1624259743777,1624259743777,,,,
S46xURPe93ZYuTsCn3O2kxXBjBA3,emma.michaud@ardian.com,true,gfE51AyCoubOxIXSpeW/c5p6gttdLa1Sb0HLd3HnifipcLTD1mYSP1cigFZ0llp8WVs6gseORCD5jo7zrrqVZQ==,ekeJnVe4n3/DHQ==,,,,,,,,,,,,,,,,,,,1606385893531,1606385893531,,,,
S4vki6EBV2abktUgUlewKjTvgra2,pierrefrancois.jauneau@ardian.com,true,cg0pbo7DqifVFfiCrVkx0M6mvEh8MVMFcBQRYxbng0npE5pukJqblmU1qMdkAzj3Ia/Ujqbpyzdp9qsPw0I/3w==,Ze4Sup8ZfIj5KQ==,,,,,,,,,,,,,,,,,,,1616407383605,1620288874568,,,,
SJ24SsOgVHgzlksXMEjSmc6SHXS2,khim.seah@ardian.com,true,qcuw5rPREb8PAjKhtBhNx4RsshWDqFRvObElhis5onovALuXWUDY8oW9bGkMjEDpj+YPPSl7F87HYnfSmWcivw==,Ef+wjsK9BWu4xg==,,,,,,,,,,,,,,,,,,,1620741949323,1621433774809,,,,
Sgx8F06X3HaliODoDx9L3KYhWR62,edouard.villain@ardian.com,true,Zhgxa0TSXM959h2awPSdLLaifTdDlhhYV/mw/UXlf58TP3wruhpHvQu+S0hsSkjy+0RSslUNFhdsUyJcw796HA==,RchTfQFvSJw6Hg==,,,,,,,,,,,,,,,,,,,1606420730177,1610383889464,,,,
SmmuRnYp3nT2cF2eRxWhqzdroKv1,gunnar.chrestin@ardian.com,true,DgmX/TUk8kMXI5lsWJWxHzQjP85I8J3QZhQ4ZTROOYpJAumxsQMg0PzviwJbjo0DkRk0Tkd0f/RHakRuCfVpoQ==,i8WFmgF/TMdo8g==,,,,,,,,,,,,,,,,,,,1603918316899,1606747563941,,,,
Smt9EKWeclMQJRjCbOyTH56tMsW2,raaj.rabheru@ardian.com,true,RqMOosR4i9s+/R+M/ORHCqYjEvuMVPTk+KZQHrZjqv37fPUV6fWJQ2Pg0EUa038g9B3C8w1Ucs4N1hLqPgqjTg==,s0WONbnC248RLA==,,,,,,,,,,,,,,,,,,,1606845202293,1621953067338,,,,
SvlgUDfjSocBAuJpmH8VPf3ChdF3,victor.piot@ardian.com,true,uR7YpiEJvpi/viGlaPn4zOz9RG1QVtMrnPnifjWncGsJVZFNYXgLg8HmLG67cRqVmBmORAwYY92c2qLSuKVpwQ==,NkB5wYg0WSE1XA==,,,,,,,,,,,,,,,,,,,1607338869858,1607338869858,,,,
SztGKerDueYMxjFH0R3UGct3stk2,eva.garcia@ardian.com,true,VpUphLnvqwd1LPctYW7nNUM9+sq07eEyTUTBihEORmpN+NLfbnuljNQbmDSmCnEuA2q54+faLrlIlgKdTB7qLQ==,DUYh2p8VwYQedg==,,,,,,,,,,,,,,,,,,,1606752806145,1623747408827,,,,
T5rClXp2ACXUxSzMWaxFYzoYOYk1,april.tissier@ardian.com,true,0zVrxn5DT9+x4HBvTyWiiOuFVxd0vE/XeIisiOvda8lNPx0IPtDfoPJFNSWKMxmlGhKcr/fGd54EoFOgskNuLg==,g14em9EmG5iH2Q==,,,,,,,,,,,,,,,,,,,1606422845393,1606422845393,,,,
TAbtnHesxmhJ209JnzJVJvL3lTv1,claire.chavaillard@ardian.com,true,J01HgfiKOikdoa4hNiuYkgfrLoYae0fAPhy88162gjKGlJt9A6jcEEq3OANg+b3rXG/2YeCBgfC2qBb99TzwZQ==,74sINYH+jju9tA==,,,,,,,,,,,,,,,,,,,1606745583242,1606745583242,,,,
TRjZp3HQysWCEzh3lIPI0TEULRC3,quentin.ledireach@ardian.com,true,1Pv0/bzxKcrHLVnO5/4MLTZ2bmiY4Tyh1KtaYn2r0Shs4jiqobsFt1NfcyNRcW01ADRlOrkb1suFxBXjJZs28A==,czRYUlEJDZBwyw==,,,,,,,,,,,,,,,,,,,1614759287654,1614759305506,,,,
TiGscdhreEN2lOQB7sPAIdEAoHq1,mayuka.tamai@ardian.com,true,ls/uEUVz1yCSnc28i8nwzYowbLB6BQvlFkjwIToLSM3rvif5JyY4vtwzNKMFdaw7rD3z72P02xMLtEo6kFLEmA==,hwp+ZDGTQQjyWg==,,,,,,,,,,,,,,,,,,,1606742046344,1606742046344,,,,
To2EvipPi4PUT85CtDHYs67ITpl1,capucine.tortiger@ardian.com,true,wj4TnKwSD2BVBd6fq5dndFIjmmntYD50QSx/mEDslmHnu7xxXLmggA+DBeXyY23vG9gbqt1m+tqXlrncRVDVmw==,s3jCXzHIr1C/sw==,,,,,,,,,,,,,,,,,,,1606467783577,1606467783577,,,,
U3HZRv7RqPg2wyoHJIUSHyP4Qsx1,claire.lehericy@ardian.com,true,gMvQOFskZjlFOQ+pe8FgVIALMj1W4BUObQWCGnw72IGIP/NXoUsx4FApSNtizWYg6jX0k2p/41MO3+wj+bKmJA==,oUtjd4FSn1kDqQ==,,,,,,,,,,,,,,,,,,,1607458964169,1607458964169,,,,
UFM5LxAyIjZ6RSyGmEPxH81CqZF3,stephanie.grace@ardian.com,true,rQtJCuy37Kb9ESC6l9nd87RrKycrzS757+ZjOPfaUI4b/mWPY/0mo0FVnlFk6ykzWxbeLq9MUWLVRhbw3Y02YA==,wm019pA8mwzTrQ==,,,,,,,,,,,,,,,,,,,1606398803071,1620315804953,,,,
UVNkNqawFZaPwCDiPEqqXT0IYgE3,nicolas.duchange@ardian.com,true,T15tc7/gVkPYIIkmIUENf617L3Z0S79u/hQjRsCDUhSzggNgEqZ7ev8VV2gxO9vflwJGbESGVe5A63Rj1oMcdw==,h23BtwNClxNKAg==,,,,,,,,,,,,,,,,,,,1606507278465,1606507278465,,,,
V3keWHHLk7MffetIAgTenSO329U2,laken.dineka@ardian.com,true,E7EPlxy1HYX2uof6vy/iX8I0tXf7nEGspvtmLQYiTfhCjv26gdhQ2CN3/mdAIuAwdGj3xVPLYNJF0LZnW0ulZw==,M1Tu919uzxrmPQ==,,,,,,,,,,,,,,,,,,,1606844153436,1607598606489,,,,
VLgBLdpTckVBclyU2FXAK4SNi3C3,roland.rataj@ardian.com,true,kKg7drf1NlxAphrDoZIkSDvXcfI32IIiy6jA4vGuCtakY9t8Dt0MKG0zLZ9IJJStaCaUEtpHscPJB5C6OH+OAg==,jeLOnfBA0F9Eng==,,,,,,,,,,,,,,,,,,,1621949584545,1621949584545,,,,
VYADtxTuPiYsg7v4OLEGXCJsIQO2,rafik.alili@ardian.com,true,JowTfRTDfXpr0lJky1KZ0HUTR6WyX6P3PZPQHaAGTZSJsuJplI6XDd7iKMRTb86GMBr6emX3U/6+SDiEpUDGPA==,AoKJL5nMR1ZO7g==,,,,,,,,,,,,,,,,,,,1606742662436,1621244219100,,,,
VZf2ex5b4DSoTVUPTNgliitIZJu1,mounira.hamrouni@ardian.com,true,79/XKi1DAe6CraPjAHy2ow/1tZUU3WjFDPozD51VVsXpIs++Y5rDEj6BZT+KOYsSeHhqTqBVoLRm8GAMbxeS5A==,U7Hijcv6k4fVxg==,,,,,,,,,,,,,,,,,,,1606469843581,1606470305558,,,,
W2Yh115GSPOrYOCFHYcIZeUMrW62,michael.obhof@ardian.com,true,VuZ89x8BtoU2JxJd+ZyvA003kWL7fyODY09aUHl5oen30BgJElxCx9FBpfCveXxzUd4vWtvck2fDGeDsMkW2Og==,kVjMAL/id0SvFw==,,,,,,,,,,,,,,,,,,,1607552385506,1607552385506,,,,
WgASPSn95WXYkwzRSqrMOSdyt7P2,marton.hunek@ardian.com,true,mbEn8G+7wBPdwjqvj80wJRNhVYzbDwFcLEk0WuaHJYX953HH4JgfGQ5k5IlvYrbKhLpaP9YdhzWdoIchqEeYVw==,N4R8N6NJPhGpVw==,,,,,,,,,,,,,,,,,,,1606500838102,1606500838102,,,,
Wi1UyMmChPPPEZwKTJgpoKBU4r83,philippe-edouard.bonnet@ardian.com,true,+CFA2dyeeos8Di1qIaOOETOdxL1HsjgGdTkIi409HpapS06+zZjYqYG6vluMt3uwMMZX4S3YeI8CulMy/yuDpQ==,HVUMpBzkdqWOCA==,,,,,,,,,,,,,,,,,,,1606425053000,1607239777781,,,,
Wiqsj6ACcCYkMfa9g71mWhOZTav1,fanny.cormier@ardian.com,true,TqYK7cc+/STSo8TWQhlDgcaCGc4ihCrLLCm3+AmJ+VxoXe3bkVN/uKmgKr9zxyf7JGw8rvglN7tZdyViMIXu0w==,pnHZAWGZOYtdmg==,,,,,,,,,,,,,,,,,,,1607069918883,1620650190335,,,,
Wxvpksh8JBWI1HFN1lHBQNZUieg2,kanji.takenaka@ardian.com,true,LTFfhYTlswm3a8BkD98SMlqtx2RdJBIOtaJZH7ZeFAfXtwj1UPs1PVUkWUdlGER+4DhwYCYUFXJMh5vB7PcC6w==,sP416suLEtak4Q==,,,,,,,,,,,,,,,,,,,1606785121434,1606785121434,,,,
XGHUCQFwZ7ZdiYxve19X42hog2u1,grace.lloyd@ardian.com,true,BDX1OiOHz9VS3T2huYiIqQLhQEVPhylUbALFOjZ1WVJ4KKHalYrbDEezcm1KJiIhdDke7d7qODi7OAseAoO5MA==,HEfM/gXB6QOJgQ==,,,,,,,,,,,,,,,,,,,1606348638904,1606348654241,,,,
XTO2HoPphkRma2yXJ1w8ezghq5c2,juan.entrecanales@ardian.com,true,WUlYrtinngLe/9ehLRb6EXr/rLKxiDrx1C6iuFF7LvaTA3flGZ2Xn3Eq08BJdiaAneKNzc38gGgVFys3x1azlg==,G73CrrdfG6bhMg==,,,,,,,,,,,,,,,,,,,1606384452879,1606384464214,,,,
XfvzWDtw0qT6WzCiEER4U7W3m4i1,quentin.hugot@ardian.com,true,rh3hF5iicRdXG5tDNmY2+ImR0zVUsnJCb2otlGGpm25l3nXNoreIvu9kJsRJuLbNAcLMmJ+QMMka35AHmSefxg==,oOaoOpmR7d9rDQ==,,,,,,,,,,,,,,,,,,,1608587934487,1608587963208,,,,
Xp4JSg9DPeXZ9rdqFjhXZHI97NI2,carmen.sanchez-cantalejo@ardian.com,true,zsq+116UXESX0+F6KeSsaPWtUCKZ09cqL/sWMHf2bFWY4JHY8c7KcekIJsQQiGnt6iYCLUKML/5H6N+S422DZg==,jyg7zFNXoO15RQ==,,,,,,,,,,,,,,,,,,,1606992197596,1606992587661,,,,
Y4zihEcSM2fBBhrTwFdhMJsYeT63,alicia.pegere@ardian.com,true,99xDSxxRx2PkW3lQEpAmMd4Fmb1M0UrAQ26nH0yXg4lsBsy3bbSS3QqK5mbOcEiyle1Myv+9NT4JABHEz41M9A==,btp5iDS693e3PA==,,,,,,,,,,,,,,,,,,,1611235224829,1611235360556,,,,
Yr07JsKTmkTnZtqx62BgqeE15za2,kevin.kruse@ardian.com,true,B5dGdBYjDheVMC1THjM3FXOgnoKb6VylTIPI5ahz/+KVwA4tSYr/5nJHcrbdcBjEOqAwoL6w9yzm9GJI23RfXg==,FLUETEyo9anJ6A==,,,,,,,,,,,,,,,,,,,1615243642079,1615243657983,,,,
YxkkaI4ErKYb2MhvCkQgOzVJz292,mariealix.salome@ardian.com,true,+WxnHYegWeOlxu29cgNN2DDh/KQD4NPEUlMaIGpvMwhkGJD7DVRy7qurp7RcaFNPqymGJllaOo3uCoBNYFVftg==,EZWaEqzdWJmI/w==,,,,,,,,,,,,,,,,,,,1621258966863,1624976111760,,,,
YzpoF9v6y2aPhQj0MMKa1dqFb3g1,wolfgang.pietzsch@ardian.com,true,JjfjDaQv+qlSt9DGZG83Oh7v1dCO1LDClL6MUuO3Y1D5+7Cewdiz5xFLn+NIzTu87NuUAPSwDKM8oECbiOkh5Q==,kd+NV36Rn6AVTQ==,,,,,,,,,,,,,,,,,,,1620141836496,1620141860833,,,,
Z1dapZAKc4Tu1c3WgiglszRs5iH3,jennifer.koziel@ardian.com,true,SiKbCdkpeSFBOFGck/5pN33q/NsoUgqYZxZWsJAnbl1QD48p+dxn5zlWEopeRaZjMJnqFZKDggbnqkqeOl8f+Q==,dyVlVwGzh/fvvw==,,,,,,,,,,,,,,,,,,,1614866861636,1620816647095,,,,
Z7gjlA0KnffiyAEriMjAHgabl4C2,apolline.lefeuvre@ardian.com,true,VpYIUonLLEFHMvRPxRnlGXBKeiZ0bd2CALb0M8P1DmNSL2yNj6xzSM+GDw3RumKdMwjAfWYQAuFL36/ny9+o0g==,0Ctxc/wN59U95Q==,,,,,,,,,,,,,,,,,,,1620806853374,1620806853374,,,,
ZUeiBgCJsRO8xhHJkbivAXzzwK13,charles.adjakpa@ardian.com,true,x0Wpcc0ALwDLl9W1JZVaDlUzvx7YDLK+W4WvuDaFfOZayypQy/q6/wY2p1A0XCKwYQYUmau6c6fDp2kBBqroXg==,Uxz/ZNtFv3pFGw==,,,,,,,,,,,,,,,,,,,1603207313311,1612120258262,,,,
ZYMEJZBM9kdWPVudGJcNhJnfrUm2,ignacio.lopezquesada@ardian.com,true,9B8CN5/QYmDi5jwm/hgVyDwlkLR7vFsNjeswvS/VBaCVuC1bm7yydd6Y2bOBDGidYpSSOnH+5aG18U4teN3goQ==,BPDf0qk6PMjGow==,,,,,,,,,,,,,,,,,,,1621939920622,1621939920622,,,,
ZZNeBivpT9N5tWu1LGccujY0blO2,louise.gros@ardian.com,true,sX3sHg+UyT2R12AW3rtKmm19qa5fjwu+SAX8wpRFaJ4QAyfUnXgmjVkN2sYXTm+4IJKo/N+9Be+uirg2A0Q4kQ==,yIxRUGYp3LcD8A==,,,,,,,,,,,,,,,,,,,1611235449110,1611235613046,,,,
aMlMHtRRYZdeYbLjlhTE37HFDTl1,david.mcdonough@ardian.com,true,0gV2kryORWw82eWBUW6eIWLM5fqpzy16KiLkjgVbj/O6yDR48zNe+zhp9W8ERwSuSop0qmKktvE/LoZlvKpLPg==,13qw0UuqT/ZRqQ==,,,,,,,,,,,,,,,,,,,1606858486498,1606858486498,,,,
aS6oTrDXBRcmI9rBEZRrvmbNghx2,marco.bellino@ardian.com,true,vEPkxomxckmh+1FgmBdyb0E4fWuqD0FNHh8mhGS5mYaS0qRurHrpzXoySo2SONNO7v5CSRfwvfc4RHsmUg2N/g==,C/UVsxnp9m7nBw==,,,,,,,,,,,,,,,,,,,1603704925191,1620721440764,,,,
akG6OHh0lUXtPoP88biRdLouNTV2,mayssa.kachicho@ardian.com,true,W8H4UIlDTyAeCpXkhNz9MyjWfcwY9nm4Od1EZNDiXESlH11hRzRljt1THwjx2RH0eFWYfEPaVSsJGImeUvXOUA==,w/O6JYogMforRA==,,,,,,,,,,,,,,,,,,,1614782662053,1614782662053,,,,
b8D28W1BS0ckeIN8k4SnW3PqqOo1,jean-david.ponsin@ardian.com,true,hmsI3KtENFm2vU97yBG5us29XZR6ySsKFyRtxaloY5dFniOSvPBKd1HsDbK/ow6ovdIP+vqgAwiOM1OVpPTCCQ==,7WilAGz6W0Bh3A==,,,,,,,,,,,,,,,,,,,1604484941634,1618322318036,,,,
b9e82ZgCtDO4taUOOWhIrfEBzV12,jonathan.ng@ardian.com,true,5f80C030eoxVe8/mTE5DsqpXBn1uM/7vThODMMvLLujd20lFauMkQPB1quI3thevWCoW2eWS2wSoem75wmv0Zg==,sPQ6alxCKamDgg==,,,,,,,,,,,,,,,,,,,1621489969266,1621489969266,,,,
blX9kD23TYTlOATxxP0fy45PEu12,tom.simpson@ardian.com,true,Ls9/UWxcYZVkLLeb22Dms9M8kOy2OI1hdfaw5i9SmJKYMvbvzW12hqn11oOAHiLNrbiujg+qeqFzWh3eHvGY0Q==,2cWe+68N5qY/Rg==,,,,,,,,,,,,,,,,,,,1614710289133,1615882002515,,,,
bzHafb81ffc4THdoinp9NotJJ8i1,stefania.pagano@ardian.com,true,gbkSJn+RGKFFOoHYYZsrxU+0+51jKSAHKf3X/wDXlHVDHdEySjNzEcG7+JkgR/UKaTlGqK5K5JDIjTHmnfbfnw==,HjdE7zWeckjQ4g==,,,,,,,,,,,,,,,,,,,1620831551197,1620831675519,,,,
cJ84XAwSSNQFZXN50sB7bN2Ckzs1,edouard.boscher@ardian.com,true,vHRquWPU+/yrKtBD9yN6k7ldQogT6wIgkXXA6F5UJxHYga9VbDOPGSZWjsuqO0/8KJcXpH3NBHDfDLtwao1exA==,LozT69TgptTUoQ==,,,,,,,,,,,,,,,,,,,1606416132187,1606416132187,,,,
cKluA85PdLMGx10wkb3XOHCpq7e2,margaux.astorgis@ardian.com,true,0DPmqFoni99DR7ITq/+t0la6Pt8QW81NL6GsDO2yX7cEuiUADStd5M9w9x/u2qqFOfUVsR+ZUfMwuqPxZdzxKg==,44jhCrZ9qanG/Q==,,,,,,,,,,,,,,,,,,,1606469835257,1606762355113,,,,
cWbdMVaG14XXvQJHYwvQ1gcHsSL2,nicolas.gazitua@ardian.com,true,g0F7bxmBTm6+ilrj8eGJsBA351DiTJk0dS65Fesme4il5WyN5H2VR+rrjndB1NpNu0kAxkDZ18Z0CAWrjtqo8w==,x7wvuVnh1kppCw==,,,,,,,,,,,,,,,,,,,1621949827104,1621949827104,,,,
cYUgqNoBj0VLe6WhijVpVF5HLb62,caspar.lagler@ardian.com,true,gJqzMMHeqlaJN7CSsw6IKVUCYxiX09GxuMFUdTt3dUnwd5rPBQ4i4cuokdvUOeeOAMW+nd1NUQw8Tu/5S4BpUg==,iQ0jzJaycowUrg==,,,,,,,,,,,,,,,,,,,1607612895805,1607612895805,,,,
cbUBZBSwHuWKD2CdcAwMUYRWFiX2,eloy.ruiz@ardian.com,true,R0d6QmcqZbKll5h3TIYdZ22KunkSNlrX4YgXHJ9llbBQ5gcyoI9vPpqS27S88AB3KcI7YEWNanchvAxCHJHcxg==,es63dfgbTSi2Jg==,,,,,,,,,,,,,,,,,,,1606448821577,1606448821577,,,,
ckFCzHtAiqMW09Me9Rj6TBwUrG13,jonathan.abitbol@ardian.com,true,nFjWd4nmbnfsGbvn1tGf1ry6uoD5Ik+gG9OfhLNdkM3qcRH0yseLLOZU1PyFw+e+GqsBbpcwkZWi8ou6m09a6g==,PNfyibjEqM6k1A==,,,,,,,,,,,,,,,,,,,1606416601406,1618232531044,,,,
cpWXMoy3VbcFgiWKZVebsjmHZKu1,alexandre.tiret@ardian.com,true,ExY52ky9Nh6gPIl7+mQ1TCZcZBF7Q9SMtX6ZEQ4DTUZJthroB1u4br+oEnFC20wfnxY9IiwB47MKt7apF5bsFQ==,f8Zh9HfSqOXs1g==,,,,,,,,,,,,,,,,,,,1606463379594,1622646732420,,,,
cuyTEayiiMau38PNNVBQVrvxl503,daisy.francis@ardian.com,true,0MFpZUsq2uiLlBvRMgfRKt8+r7jPgVEIpfvCHMAzNn12iNa7AxRyG/6evpRmzJ3Csjom/Y2Pz28Yd0GhDDcndQ==,fBqMiS0rojMzxA==,,,,,,,,,,,,,,,,,,,1606827402839,1606827402839,,,,
d9STI8asOSN2KinGmk2NpFBswtr1,patrick.shuttleworth@ardian.com,true,9HnX73wAq0/4fykV0p1LP+16FRofTCDdFSbJ+2bPHI6wWlM4uX8yQDRMvxs5VDXVZv6s1QMszicGrjqlHwivHg==,yt4eDoei4qFNmg==,,,,,,,,,,,,,,,,,,,1606730846575,1606730909527,,,,
dDvCMk3gEYQ4e9A35mOVTEHAFF53,nicolas.trani@ardian.com,true,r2MPqCOJ+rsSpma2HGKPzUg1ycswqGPdFWVMI5tIKqN3TonmcbE8kPSSqPzwdIP+RhwuugoHnQ+7hCfraOPdWg==,QxXmRBpXuCaimg==,,,,,,,,,,,,,,,,,,,1606413921500,1606413921500,,,,
dXYJ0XZdIyPIw2Sncnt1myYRudf2,dirk.wittneben@ardian.com,true,EEhE/VeP1p3LWQgDVL1V745vkFnNnOQSqZXXt1zpDVU6pQkYfPVGFIY4uyHTnB4eML69Gq06fWu/6Q0a1XBLbQ==,dFckJnlRF+LIcg==,,,,,,,,,,,,,,,,,,,1606416079128,1606416079128,,,,
dkwqhMNOR5dZ0oHq4u1b2n6oO0k1,fabrizio.raso@ardian.com,true,EmkLp3HLxSBizRqm9kULKxW1OL80lW5AZUphEf3kjFVZlxk5jK01CJhrAZJrS0Het8xUe+mj6v/RvaeW4uQ9Eg==,EXxK7DBDrTLAzQ==,,,,,,,,,,,,,,,,,,,1620816254846,1621859730915,,,,
dtNYPacj9IOOp8DB9GRrMa657W82,scarlett.omarbroca@ardian.com,true,2ts/SozZyJjpoRXGCzrRWQpx1v47sMkFIbKAPH4SUM7kWLVwlkG/oHZnAOKcRJ+Pcz3LWbcTpxNPcnyIxbx/QQ==,e8ZaJSgHN8bKYQ==,,,,,,,,,,,,,,,,,,,1615387694638,1615388010710,,,,
dvVg4lkBT9hlQN3GX3NJBBX1tJ02,chieko.ochiai@ardian.com,true,gFwC++GT4YI51rtEoSsS8K/9ghbLg2+li4biuw7tKG6tzsnHx5MuhD12i/a+BUU33LuSv3CQMbId10+A8ohBNQ==,6BplrWD0Heqyqg==,,,,,,,,,,,,,,,,,,,1606781467871,1606781467871,,,,
e5pbVqfjFZdFA4OUHL7aveBwfVr1,matthieu.labouche@ardian.com,true,dy/bnwsqE3bZgII6ETxV//bqUg/cyrZO/ibWxVNSGA68GfTBID8g1bhB6x+W23M1cRSGPbjcdin6mlaz1K2Ltg==,IDxbil5aBn8RMQ==,,,,,,,,,,,,,,,,,,,1620133819195,1620133819195,,,,
emlJXsJpkgafwfy8Swx1Xebanrd2,daniel.noeltner@ardian.com,true,jAGWRkqbRRs+4WY4Ii9h/ZFZKtsyA2W+5gGVdz0DCQW5tb4pwKgFLGAo8t0mWR6W4bCe+8sYRZmAek2OVULp8A==,I6QaOGbEJ8mRfA==,,,,,,,,,,,,,,,,,,,1603872717643,1603872717643,,,,
epSNOATeNEZSW7Pei5EjimL0ImS2,marie-line.blancomunoz@ardian.com,true,eYT6Jk3VaJHvbFEpByUnF3uHX69tla8bETPwDYJStjaNUSQT7EGvRJj/99t1p9rOFWp+NJrUMy8+ipORmI/MIw==,vlF5CRiDaX8atA==,,,,,,,,,,,,,,,,,,,1614782665469,1614782665469,,,,
euie3KA9ZyUChahQVMbkHZnwsbk2,gonzalo.fernandez@ardian.com,true,seFPu0BXNctOJLEGHwsdYaojz1xmMKpyGilRqtktRoP4NSvcoQ4pgB6O5SYlkryq+6sQuiXy5WU6ZuwlYYIMfg==,VsLejLni8yxvsw==,,,,,,,,,,,,,,,,,,,1606745580101,1606745580101,,,,
ezy61mXqgKMNZxNbd0S66Vw6mRj1,sofia.gomez@ardian.com,true,vFhLv5F9ttrMRw9IH1XP6Ccvz2Gzb8NphcAvKG02XMM8SkbsY9GQXd7z9Dh4GSkfLtqvdzCXLx/VraqlAqG1NA==,DWC+qHUMDLcq1Q==,,,,,,,,,,,,,,,,,,,1607965344329,1607965484554,,,,
f1BowgQNUZgzkwHL9aoJJVrEiiS2,christina.salwski@ardian.com,false,SyZLKqBx3ga8nT7MF+W+EIO89fkfqIbKI8kkD2GBKuyvfadXgwVBLufFqpLzjbhlbLbCdmrDpveeF2GyTadLCA==,mxYAQbSwjHfdiQ==,,,,,,,,,,,,,,,,,,,1616080666875,1616080666875,,,,
f1wpQKFWs3N3h3UO36IITjVqxWH3,pf.dessard@ardian.com,true,LQjOCszNbb8w8cyfve/8ZbnIWvG/n7RuhW7baQ4wciv+dnfhlL7Yu9Yu5k7uwaheeQJnUeL/Js7ZRZ9xg2lOSg==,qqLCMRWVJSKg8g==,,,,,,,,,,,,,,,,,,,1606423224842,1606423224842,,,,
g5E1jLhGzZXyDAkF9CQYlNf6YHF3,lisi.she@ardian.com,true,I9ElRSkdLSlw1VFo5ZU6xrw6ruOfw74SA0fdMowj0j7VKYX4sdBWWXL4AwzpgSYj7aBHgCl/7dXZu0Gra/Ldkw==,LjwGQ72e/bPSsQ==,,,,,,,,,,,,,,,,,,,1606383524911,1616579728829,,,,
gAU7CCylaFPq8e9fzfnMGRZTWMo2,angus.robertson@ardian.com,true,0SGnwH2N8u8L+rYxxHiDfNau+w5+fXXC2DZXCGGEigjCKq32tx5Yd9iy6A2gML6W1YGR47kPTjtjVfm9+eZF+g==,ykQLzkcDzb+a8A==,,,,,,,,,,,,,,,,,,,1603818501195,1603818515601,,,,
gGg1ckJAMxdtVVadrWsllvHHGFH2,remi.grentzinger@ardian.com,true,If45zz3Dd1RvwH6HTHKLOqXoiGADNG0GfvPwoCfJkxKTWrZxJZbiknWoxBS49fS0JBPqQr3yBXjYSBEZJMILuQ==,tv5gza1dle5ZcA==,,,,,,,,,,,,,,,,,,,1606759616623,1607120042540,,,,
gHOFVkjSC2ZgBCEsShHbn6fdwmu2,charlie.davis@ardian.com,true,x/y2IEwtHxLSbNXcD2PK7RZ0rCHu9WfuSDVpJOePUTnzK4WgmO4gp60iF9Q+/RGqmSnZKutUTsyGypS4WnBqdA==,/JKUBntUYLok/Q==,,,,,,,,,,,,,,,,,,,1606382009417,1606382009417,,,,
gIJh5563icQX7f61K2L2VuqGtop1,sebastien.begue@ardian.com,true,4w9sC3LHZT2KQn/ukh8b/GAmQFZBJ0RH6/fIuFXG9yg1ci8u47n0uNWHwkEp2Er58UXcNcFSq62Y2mzUWPfs+A==,44mPw8bUPYlTOQ==,,,,,,,,,,,,,,,,,,,1606725432535,1606725432535,,,,
gKVX6gKuXjXgNCSKhyIFZ2ztTwI2,leo.kensicher@ardian.com,true,7tvDGZ5d7HSeEKrt64diDQNdj/QG6OIzFejjXh6PxP4HJnvtN+pZKKI8p5ab8+Wg6ygJPDqFgf998S2EtlFdcQ==,hq4+IHvBpl87vA==,,,,,,,,,,,,,,,,,,,1620997151852,1623452521003,,,,
gNHZpfXZ1oMtpdpXydJ5AT91GSQ2,michel.fellmann@ardian.com,true,DElquonelQVL5NgaR7yAIOXwscRcd61o49ycpkUrAGa0Os1+5OrpQ8SDupBhO4DLNgfWj4rhDU/2wcPQ2YhygQ==,AOrUFN8U6VmyJg==,,,,,,,,,,,,,,,,,,,1606859930024,1606859930024,,,,
gW7xEofqFBafQkg5swiB9CSr5v92,michael.ferragamo@ardian.com,true,yYA6pMM0FvQ0SFORiaIDM18hOP8O/19AZIJjqvkXZV9xt/dvYuNLJ6nQtqc9qITvt05qc4rOFoNYeOdL9oXw9Q==,MQINAGqnVXpW9A==,,,,,,,,,,,,,,,,,,,1606908462066,1606908462066,,,,
ggKTl992tLNyc40vFTPtmcPiG032,anais.llodra@ardian.com,true,6N4D4vgRW42fpaLFnKmbphbxwfRGFE+15aidcVMKocpeX4V3G3gxowmn9cfPhgiwIQmcC8wNDEOKI3KaPwpWjg==,R9bO6k/CZLTI/w==,,,,,,,,,,,,,,,,,,,1608131420506,1608131452416,,,,
gwom6jIZ6oMloHFqskMbezSY9QG3,anna.brusamolino@ardian.com,true,8zlyy4tSPAlsRmnDVURhbhh3K9FCRwJkx9OKGVgcUvQFoYd+h3toZLfwsVqG0Qv0lLFNbr+/0yTurIjHKqaoEQ==,fpQc1Fn4t/fC3A==,,,,,,,,,,,,,,,,,,,1608546678863,1622100976514,,,,
gyMxhArq6jbgSqfgTTSE9Hjfuky1,aaron.deutsch@ardian.com,true,eLyo7QGZ6nvT1CI+q8zDImAq+EKYsoCzqZE2cxZt2/ACB5refLIkEHI5/u4JXAqn+t0Swz2w/0A/pfazkZwFgA==,p/kFU+EI7e4Bbw==,,,,,,,,,,,,,,,,,,,1606772205681,1606772205681,,,,
h10BtlgdYqekLvCexEwMlI9IPcK2,cyril.auger@ardian.com,true,RnxVMkc5ITx/zgbJBlZWLK9xViEg419qlvyO7+zQcuUKL3YD6lc75BNawq4KZIRa3EM04E6eZE4gLjPkPzLdqQ==,2CU6p1ng0vE82w==,,,,,,,,,,,,,,,,,,,1606817181603,1621882578013,,,,
hD8VXXmi89QsginxPQ6GpGuEhEs1,stephane.guichard@ardian.com,true,spr4hNM4PRkjnTXhgA6AFoXTtUTfDMxIpT9WCwF6s3INiZsv7wrQwYFS+oAsBocyFesTTB5OklL/TubcUYK/6w==,1AW2uUaN8YtsOA==,,,,,,,,,,,,,,,,,,,1621925405424,1621925405424,,,,
hGqZmDOsZ0f8pFDUGyOUzwPMJZh1,loic.henriot@ardian.com,true,DxIg0/LblyrnW7qpAhOy79zwzT74nb3AHZ15pAHRvI2Lt7tbANDz+/tRwykEo1Ht8dyfEz17hOaeZVRiXW0B5A==,msYdkdW5QVTGCw==,,,,,,,,,,,,,,,,,,,1606422501765,1606860629460,,,,
hShcWJqRU9QB8ZjTu1JmbGxNeLF3,nadine.zariffa@ardian.com,true,sxn+IWSJrtjZRwq/3hflZ3wVgEjy1DSeI014zgZN9Qb4X3D0OuIrgptnXJFd6Osaedt4jUe3YLlMwoYsQ5v6fA==,wjifb8H+M5xT2w==,,,,,,,,,,,,,,,,,,,1620732631806,1621850456626,,,,
hXT3ohMqrjSNigTu5OiEsT6DXtV2,amir.sharifi@ardian.com,true,tG7dtB9Kxk3mGpUGwgAY8xwQiOnL8S13QSX9TvRskzRe7PNXUNesQgpwUCWThnkOE/pLpt/yEdzISYPSp9L1Dw==,NrUrmg7DIKyNSw==,,,,,,,,,,,,,,,,,,,1606381343152,1606416706304,,,,
hl6B8m5c9zLkqvWzJDGfLEO22ZI2,maxime.pasqualini@ardian.com,true,RdARRqIUdqaq6J5ZxFDgPdIlvaaMnypMnbyC4k4NBCn37aiD//QYtr2Pqtwp8fuWAumb7swVzUpc3ssk2iIZdA==,WzGFlRSvjDt8CA==,,,,,,,,,,,,,,,,,,,1606398746238,1606398746238,,,,
hxlMYWFmHBP8lwIkWxjfAbNA2hb2,amelie.zampa@ardian.com,true,KcwikoOrcdv4rzwhxaZD065AnbDNui7eouQsTVRaQSYMMwHrGBLWfE/TeZqwL/6JsbqHPAH5Dz8e5OLWk18oUQ==,qxKjP2gDGmsfNA==,,,,,,,,,,,,,,,,,,,1621431824163,1621431824163,,,,
i5t7CrH8dmY9ZVOHmZOKL0JiwHt1,sarah.harris@ardian.com,true,qsA7pwdUVstjRI0vcouWhwlhISaUo40FRFBjUusGpYbdRpN6/vAECgnzix5KDl6P1qzEF/pRcHma7sW8rvxKew==,rHq7EjBW7m6HvQ==,,,,,,,,,,,,,,,,,,,1606759881072,1606759881072,,,,
iHxASlAWY3SFSMHHdvOWE8BsyMp2,nicolas.fernandez@ardian.com,true,UIPD+XI1ymY7sT+6mkGvK7apLQ1JbhA1+QSdc7vt5aitwwGXYocMVpe0UV84xPRIxTWnbUEU+WS0olGqc1aFAw==,G4h6stgmsCQksg==,,,,,,,,,,,,,,,,,,,1606466496364,1606466496364,,,,
iI6lTCMoKfaAhyAVymCwt2jVGPh1,felix.signorell@ardian.com,true,hf29RBaYJGSnCPiCKiSYcXq3F7aQUrf+BIUaH4eAx+grK8p5OMAZ15f/JaPPXE7s5XYBfFavXdvTNOuIMxnqqw==,MilcH3Lz0Llrlg==,,,,,,,,,,,,,,,,,,,1621528542302,1621528542302,,,,
iIJuGliBEAVsj3FiiWKPKgTZWIN2,augustin.topinchuet@ardian.com,true,hgagEhgl+AU0YL20OhAobsy2lSOwY0SA3NLQ8G/+0v2Ucat/qR5KfSAC/36wvFkJOgAih7EIZ08f5gr9eidEyg==,n6PpO76n9ThIsg==,,,,,,,,,,,,,,,,,,,1618403134656,1618403134656,,,,
iPWyJhzcAyQJjvmRUFvwkkVGJAB3,robert.capron@ardian.com,true,QvbaHOYXJzKkN7nWhmAGwiYxwQ/ZLq8/uijkG2S47960CHYJlhu8Vypw6Ascxj/Noeo0LLbrfGRnPZPgxMJt/w==,GPHE6it2gJxZ2Q==,,,,,,,,,,,,,,,,,,,1608122890048,1608122890048,,,,
ic7t16NzdxSqrY1bf08lbBwpBeF2,patrick.kocsi@ardian.com,true,c5VCrLH0QAtLHU+ZkQMvmCCcWyOPIf9uB8iZMt47AVmQuWuvNFai2M6RragM9q2bXtGzcpOTi2GOzQEnIspJPg==,9pJRda9TzPX27Q==,,,,,,,,,,,,,,,,,,,1620834390692,1620834390692,,,,
io22C3XWWpTThdPgxhjCJ7P0Mc83,loic.dufaud@ardian.com,true,T7CjNOnpYRi20oLqcqVRJYYhByvp54rMj41iBz02etcWBWiRGEmlfd+IMjegzCCRgSsJefl6lnn80Q/p0LVlfQ==,nlBlAW+CKHyq4w==,,,,,,,,,,,,,,,,,,,1606388536852,1606388536852,,,,
iwSruxhu8scNayxSSsOXW58x9MI2,bertrand.chevalier@ardian.com,true,fTM+eext9oWy6vZdcu6xDZRWkEk7JgNFJ2cokRAnZoPNjWtzT7XA1mj3sMIvywOvEoaZpa/ZsgtPdJFWyVUo4w==,jdhzDSz1/pQORA==,,,,,,,,,,,,,,,,,,,1606819855134,1606819855134,,,,
j391hr4qE0QLIJ1DpYolo72YRed2,celestin.vallois@ardian.com,true,Zo7xfSIZfqomN2ESLdKuPLDcdEzMewVV64wODNwUEH77ILE1nu6PwsPE8aglXx0ly2MmMXjsrcRZmM7WELtL6Q==,gvAmMYlijc1thA==,,,,,,,,,,,,,,,,,,,1618232549533,1618232549533,,,,
j6YIP4UOGONGICtL87co6AAUZ2p2,w.hda@ardian.com,false,b4D8Kf0uvhVL9xGUowSrK/yHp8EUFajHWqW6ZKdWPqHkHScDSm8sgxSg48OqmnjpzekPlR7KfMkEODQiHQOQrw==,3pk9dPWMpfHmrg==,,,,,,,,,,,,,,,,,,,1619099643187,1619100880077,,,,
jBJ9Msh7bzS9ez8OG446RXtSRiD2,aoife.hynes@ardian.com,true,QxP5ZtppWsql2htRhXwyAFyWd/Uylzp0+6MxGjAqNPe9VYXxG3ukmNXzYH7aOQO5E20qoP8h+cKVmZYsuiwZgA==,uwny5/D6JHBw2g==,,,,,,,,,,,,,,,,,,,1606854293288,1606854293288,,,,
jMu6eszueZVBogGRYvVrpDpjDkC2,fabian.molter@ardian.com,true,brfLWPoF4x1tBL96iS0knFx0QUPfZlifg5+qbsezoAq9qyShV1yjAI0h7XPcwGmEgOdZe6b/ufq88STvi91SkA==,b80jcHptc2k3+w==,,,,,,,,,,,,,,,,,,,1621258962046,1621258962046,,,,
jaqXsib7QlX9VIaqBO61sBgQ9so1,ursuleanne.micheldecazotte@ardian.com,true,uWzQks/Hkxbk5NU3Dv/iEbPwGzT5Q6uxBV6KPxVrP8H4hYHwBwPxjhRwZq5uy+SC3QV4Y3V02ZPlCnmbUrmPgg==,U7uuOiUUFrnKig==,,,,,,,,,,,,,,,,,,,1603295440182,1619105972441,,,,
jut1quOnIDPMPGdsdb8pg8CEZwc2,leonard.rasche@ardian.com,true,dF5bLaPiP6U9Hk9VCuwqjVPGnemuPsuU7uEHZJU20z1zafkEY6gyvvlRq1cIoETfnXjgXM46z3MLQ6rtcuxw7Q==,e/+I3a7CSuqhgg==,,,,,,,,,,,,,,,,,,,1623679829579,1623833879805,,,,
jySQFl6cLCRjkJWvHvkhCjfpblI2,justine.leguillou@ardian.com,true,wEMxRjOPWskvnDq5RKVKszcmGYqStZ/obJsiIGRHwqoLnYjZ60npggdMIbBLDiOyxKYurP7sGBNc9pwJfQVY7A==,V1fU1kSAWJiBiw==,,,,,,,,,,,,,,,,,,,1606374235606,1606417281235,,,,
k0ng4Ot78PXtIcIeV0zZZb3WPDD2,alexis.saada@ardian.com,true,ZhcFELBfUOc6grC+aSBajyc0mxfO1RSyUOF7Xys/gKFCEGPW4h+7Agy0RRu6Z85yFPHC+xNkHfhIdsl5yli6eQ==,fPHVJOLSpig8vA==,,,,,,,,,,,,,,,,,,,1606725072565,1606725083452,,,,
kZu0E9QGuNbrqOpCBxFqIHYYsP32,chloe.couprie@ardian.com,true,RrsZi9IkuPQOCzKMxObL3rr4/MoSqKOL4tJiIOMvoYRX4vJzv08JpjMtnV88oGIoIialX5/JK9VuLiUMyvAfZw==,U1n2glFBlweoPQ==,,,,,,,,,,,,,,,,,,,1606416042209,1606417418432,,,,
klc6iUCegLhEXLphQWisa5zCUz63,ardianclickandgive@ardian.com,false,VYznE6MCeQEDhkfp49bafa8hxEV5zlAPrGUKB1JyTyU6lWl1RjXBSSYqRobRYUICEtqEs+7FCQbCMk0AzgaXtA==,zc71nddeNFv8dA==,,,,,,,,,,,,,,,,,,,1603294600408,1603294600408,,,,
kw42eS86xbThkH8oryCEwq1yAN72,alexandre@samesame.co,true,7C1X1A9z7uESZkzVkue9+oRRGWsXEAkAy1WTTUCKQYAUGEMtIe/mSHx4EaBz3pESryQQFefWN3z0JvRLHqc11g==,pF2plZRyMgCkIg==,,,,,,,,,,,,,,,,,,,1602777595007,1624636345405,,,,
kxh8ais9nSbyJgWQgt0gWfz2Azp2,camill.salomon@ardian.com,true,CUM8LpAUOPhhwg7nG2+sEX0KkkJmMztMzqS1WAbuPeGDLguO2lSMHRd1Jsq1kUumfHZKV9vtqlNt+TY99tTGZA==,hEAYwIEqwF5BgA==,,,,,,,,,,,,,,,,,,,1603350755124,1603350755124,,,,
lKx82CnzvYdENrp1dsKewDG6D993,verena.biale@ardian.com,true,ZLIzfu8aGfqSLGlRe/sby0FPQll0+F3C9ptavK/oGEakAea4KdtEzHTcmHQ1ou0goYrwd5roDIiLo893MCLZeA==,exNksRUthF2r2A==,,,,,,,,,,,,,,,,,,,1606831556758,1606831556758,,,,
lR7HNGuNILgt8XMxtyUv0nFJxg62,anna.paternostro@ardian.com,true,B4vy8YnWDG4PEycrPDS0mJ3QUsUbVowoEz8y7yBaBdRNoAS8gXWq6FQKCv7SfmAMSCQSmBDw4zm491iaAHtKnQ==,O8esDg62zy4E6w==,,,,,,,,,,,,,,,,,,,1607360429384,1607360429384,,,,
lj9B93HkKmc6qo9emj8djhuDmob2,amandine.maquet@ardian.com,true,AazFAHZSkyt8+eJjicEMPlK6Y7yNIq3/0PBVGxc2mfnWDkp7+4o3fw27lrC8jrRkvsraIgGDGGr2WXKzdmHd4g==,aPBIiUktV4eTCg==,,,,,,,,,,,,,,,,,,,1620133477896,1620133477896,,,,
mC6x9HKqCFhHHfR5ZRJXk5GCY593,kevin.rohde@ardian.com,true,4cBEgZH8z1M5Dby1LP97xEWId9eViMvylB8Qqoq2Sy0NuXlahrxVxIgMD96w9SFoskKOyH0THFyEmwy33DmQ9g==,vUOYXiU1a9uPyA==,,,,,,,,,,,,,,,,,,,1611436958029,1611436958029,,,,
mDoTM9kpwPMiF9hLIFriDUa4Zmf1,thierry.denoyel@ardian.com,true,xYSGr5pblmENwpZo8eo1f5UexH4oBcaMtIlwa7J1BwcyojVp8oZL/+RYFTOOUF4EZwr8aRwP+rkN+qgMXMMbzg==,8FioK+Eo5RP3qQ==,,,,,,,,,,,,,,,,,,,1606856152432,1606856152432,,,,
mFsMWa3B7ZZExTJ877vJxinGBWD3,marlon.sandvoss@ardian.com,true,vnsoCVTXieNrF7qGxlp9CZKn3VNmKGA1yh6Aot9Mi5hS9e11i27KJh2jni/fj4KCCWHERbhS/kqp4XIF1gJOFQ==,0kB0Kd49CA3RSg==,,,,,,,,,,,,,,,,,,,1612530373654,1612530373654,,,,
mK3eMsfjr2MwnIQ65cHfVyx72sg2,benoit.verbrugghe@ardian.com,true,b72dDlh6ShtL330+IiFW28cP5AdV3WvH/lNgSMdPk5BQFhI21JCDTaGBOZx2r/7hPq5gXEROPrh9wXklW0lyXA==,Q3IrsTcISvYCfg==,,,,,,,,,,,,,,,,,,,1607613393905,1616086587553,,,,
mUjTlWZAT3VqfCJKE5vFAlLok3W2,christine.garcia@ardian.com,true,O/g71vIw2zQ/Z5JSUj08m23338EX5hodx0NcK+mla7I8cQN19j6gSt6XwUXL88Nn86XCvIfIFQiBvo/0KMDfuQ==,GOi+1aYCyVHj5g==,,,,,,,,,,,,,,,,,,,1614854853885,1614854853885,,,,
mZ9vPWTpiAWaYmj71g4vIQwIMHw2,luis.huete@ardian.com,true,dwgydr/KIMUgnZLYM7dyf7cIXvQxi+9wx5xADutgJCJ9V4PMtEMo7pzcAS3Yf9ezEzWKXsSTykmMJ9K1NMGDPA==,3hHXKqXNWOaEGA==,,,,,,,,,,,,,,,,,,,1620827224600,1620827224600,,,,
mbrFZznookbnOA2SBbe0nhgXAbI3,yann.chareton@ardian.com,true,PNkznm51Z8uXdKiiTXXLfdf5BS0XQnlS8KQPSlMJDK8VVsisDEYzQorN7cvwgHN/RpjBLIpHE4Kc9FW8yoTIyA==,uip3/n9aHoH1Ew==,,,,,,,,,,,,,,,,,,,1621261548146,1621485687708,,,,
mqilvdVwuCTlnxCU7DKzsPg90od2,delphine.caloni@ardian.com,true,USUMqN8r5CoPYBcd6pEa9YFum9DBkGVMlIOS4JGdrbeEdZfBFnd/d1rs26WCToH2ZNBzabS4DY4njwBZ6OmxIA==,wosInygVsM6CLQ==,,,,,,,,,,,,,,,,,,,1606422300358,1606483827949,,,,
msHrvLZ2o4hEAsJyMYb9JwyfDlZ2,vladimir.colas@ardian.com,true,O/VT5mT0GILadw8EBamMfzEm33WyH8djHlhgeGhUJ5VNyQOmPSfb2I4ialirs8Nc0EBs8g6tCN5Xsy4D59W/mA==,5+opBteAtrN54Q==,,,,,,,,,,,,,,,,,,,1606745122146,1615493146333,,,,
myMrBab2VxevVxCiKou41Hssawo2,houtan.kabiri@ardian.com,true,a9Wxxhug/Y+a02w3c/qrcf4+ehqK9Pc25iy9hWEB3Y1fLjnUIokQNndj1xbxnoC9x0HplsuUT9swmQNjXnVKgQ==,H5ciCWKig2YLDQ==,,,,,,,,,,,,,,,,,,,1620991969424,1620991969424,,,,
nClgD5CdvIM0tBUWF2Q9vudyvCu2,matthew.thornton@ardian.com,true,jDfq5XcgwID/w3kgrBjESzqJs9DFo2VAfdRZwaMNnXvpDjh6WiJQhgziKaWo+YNAFZQ405ZKvbVgcuDkQmsnFA==,hIDHNjFgaeThPg==,,,,,,,,,,,,,,,,,,,1604320167009,1605620888606,,,,
o8e2OYIqtObs9ozmgV47O10haol1,pia.strätz@ardian.com,false,Jqn2iWvX8xyVMwpH+xqFn2SLoMgnzvqA/oGpTOwsM8UONsxlNPFHddA7oK/VLUBnJHAl5XSxZtW/mETXvhZIcw==,A8f+6PWeuInl8g==,,,,,,,,,,,,,,,,,,,1606796806237,1606796806237,,,,
oH3FRLbn3zRUN76f0bfUh1NkmVI3,marianne.sinonke@ardian.com,true,RYcU/eY5snEEInLwjEe7SYcHH95qbDqqQeHZBhBl3BNO1LvyIxI61rNjQ0bI+YOHMXrBlQaMBLiYBqSQtRmOEA==,9o8cvOFkFgtfZQ==,,,,,,,,,,,,,,,,,,,1618232796829,1618232876487,,,,
ouEU900HznSJyccrm1GnWCAH1ZA3,hadia.kebe@ardian.com,true,M/6bpEPznaZcFOrW9AkMgShxnWpqcAQ5EZss06ehIAPliacGFn6yvHWBdm1+swxrYk0rWaqjAkKP7XN54i2TCQ==,RPip/57iqHBfSQ==,,,,,,,,,,,,,,,,,,,1603352363721,1606386563365,,,,
oyAHo7uXzJfZqX2H1IhhgpLKdif1,jonathan.williams@ardian.com,true,9+c5aTgyzakl5YiVPZbyR87F4H69GcCtrtXghfrjuDp9kmASIytrM/ne8K3a6zmF+gqTfIHeY9pX0F100aM1+A==,0y68XdFMo+N7FA==,,,,,,,,,,,,,,,,,,,1606731652068,1608125546945,,,,
p3RL5chxd8MuQ2eXkhLI82RSIny2,eveline.trachsel@ardian.com,true,gfkmVFO3egBYlpCMQlZemOLRU6/BMszLSfePGZUg9M1ll8QxtauGTI5RHHYCsvq4rm/sMwnPhAsMJtPU85W7SA==,5HEg1izRuuIIqw==,,,,,,,,,,,,,,,,,,,1616074672938,1616074804078,,,,
p4H3X3t6wZQE2H9l9ckiQGcY9C02,jerome.jouyet@ardian.com,true,EslbAoRfVBbA+EoHWLM/uXh1P7Y3o47EpZ1Bm6CIgA0eRU0R+qqNYsvvGcsNsYevU7NfNiaRmf8i3v7KMoEEBg==,Mo5MLxBAMkqWoA==,,,,,,,,,,,,,,,,,,,1606856579531,1606856579531,,,,
pAjs3AvGcrcTtwIqT8jcpN3Jsfw1,antje.romero.flores@ardian.com,true,AODDfi6dmKkGl41yFdwro2GKqxpY3sI5+i+F2rFhoTO8b4jh8e47H9kaeLGfUynks8bZsCv3M3Aw16A0PH+5zw==,Dw05XH5Zb/yj5w==,,,,,,,,,,,,,,,,,,,1606389476702,1622108444883,,,,
pa7N3OVZ07MKL46RQ0oVlhSRgLF3,francis.bekx@ardian.com,true,hMiB2YbVpi6k+SYtmwsq4yTORSXy77EAjb7I679VU4IreacRwOdniA2zYR8+uTwWAFB9hVA3ctEyIf9CIC8Zag==,QD6Ejww8BGKATA==,,,,,,,,,,,,,,,,,,,1611105035293,1611105035293,,,,
pi6lisO2Vpcgg8h5RWLjBuL9PQB3,luke.chmielinski@ardian.com,true,pyo/1vFPTaW+AV6MOU6anKTBq2/kst7T7adSGJNSNoDTwYNf1/PsVPS5RIRtN7Zk42P473M1qHRxPKcu+xFcAg==,m894y9Jk7feSbw==,,,,,,,,,,,,,,,,,,,1608054040365,1608054231622,,,,
pp5Tvzzz6iUZcya2rSoaKM6ZXvE3,kaori.furusawa@ardian.com,true,cn9bI+Gm9Oj+E/FHu8UBkvdUB6RxnEgzWLbJwEgqqxQN+NaPX7Yf09oCCINEt5gPYSgCl56j4pWkpMm4jjhr6A==,+VvD0d5rvhxdsQ==,,,,,,,,,,,,,,,,,,,1615515559697,1615515559697,,,,
qKQph0dkX9TbjXeWszJvevFCZk23,matthew.henshall@ardian.com,true,h9CSeDLN1aXWffEIpqJtfAJEdXWFRUtaRdvTaL8Ahxvd5cYGFOCESjI1tE+LVTzAEg6nLpuDjCnI7QZHO8bVTg==,thJrdZdZlWxw0A==,,,,,,,,,,,,,,,,,,,1616756326885,1617029400120,,,,
qRFjLz1hggOPJQUtC83RGZdJ00w2,matthew.simon@ardian.com,true,h156d8EyFEZCsH2Q2cG1EfTyKl6EKkAYGVmSgcidJgqkhpOuMf723vA/xPMeNzSjwjmj+W1o7oQ3lJ5OE7W/RA==,fgXBzQF5mAyj9w==,,,,,,,,,,,,,,,,,,,1614709811622,1622033659112,,,,
qqBeN5BosgRfCM4LxoSYXcptIjJ3,stephanie.bensimon@ardian.com,true,I6mbGIEQ4ukpQWDIK4n3tZrBwuye4Bd7iNOvKO1BUhY4cHb1NOnAX3JlLp+XORc8fa5nmlE/nG44O45QiUH1Iw==,GcxJ4p5uM5Ma8Q==,,,,,,,,,,,,,,,,,,,1606502185434,1606502185434,,,,
rEpsOc9ca2fpSNoxsFZWP2ux7Lg2,michael.rudolf@ardian.com,true,se2gEMUidJY2Gj0xLip+7Qbm4eW1tkdKAuAcizf9wB+mkvc9wb4JY4w0ELKhTNPzyc3YjniJvnn0GLa7aFLs+g==,7SNC73N3/H3yLg==,,,,,,,,,,,,,,,,,,,1621258931316,1621258931316,,,,
rEuDB2bplKcIm9ePDLAq2kBPLgs2,isabelle.fan@ardian.com,true,r9cyBscgYsfEHYXAhBdvLrumA+M/TV5IIeu6Sp5VFismElFvN5jB8epUl30YrpOLD6Q+UXiVaqc9E9TF93zTaA==,pgJ8PTdGE4Aq3w==,,,,,,,,,,,,,,,,,,,1606905072768,1606905106030,,,,
rOqY6JPkgwh8bC9rUmWkmfY9dQ13,serafeim.sakellis@ardian.com,true,+Yq7WPNHMhvMwAxoEODBwzIOYlMfkXbhr75agnVgNo/5uFNc6BBHYTmlDzxNEAfLi9HyS1g9+p30bRJ2peaF7g==,aUUZ3AvmQryFSw==,,,,,,,,,,,,,,,,,,,1606816701253,1606816701253,,,,
rd6CWI1gLla96FysLt502HFtXr92,joanna.abena@ardian.com,true,InZOYbQ3vcyXwqz1jyMa2lWwsseEkuIvQszv5EWFq2lUxb/m0nfM7ON2/ENnXuSABPMUWtRLQ4qim230LLhWhw==,1ta2attviMTkXg==,,,,,,,,,,,,,,,,,,,1620735981108,1620736128196,,,,
rzmkzsBkrYe11Fu1m3aMsnxtnAt2,sylvie.dagues@ardian.com,true,TTC9NKFYbGgnRY6wic1IIRDa+Yc6lmQFq4pncp1M64ZuOUCpDq2JI5YSp7DiF8PlIPV4Fp+9J7DyWcTa/xJsRw==,p8ysJRVLEK9vng==,,,,,,,,,,,,,,,,,,,1607332112695,1607332112695,,,,
s1AVmC0JuafMNyHYfWxPAgEePP22,yves.genouvrier@ardian.com,true,01uBglzgcSdWSV1VJOL9Cg/LF3oMtoCFFbDlaz+hVo2GQstgyy73rGACPfU5Z6RtszMUMeBRU8S3ItX8hmSJfA==,LOU/23EsuDviZw==,,,,,,,,,,,,,,,,,,,1606374344608,1606374344608,,,,
sI7oFDTLgHOq3LPb9DSaqsUaA732,victoria.khudoleeva@ardian.com,true,6QviAToYqIeAhAF7SI2Pn/kHCexmlH+NOhuC5Q2z3Mdmnz4uYwQVx2KmF2fwp0SuvmZ5LEirgaYjP3Vg7UC3RA==,5uK/kPhVGec5rA==,,,,,,,,,,,,,,,,,,,1614761544783,1614761544783,,,,
sSbd158uP4dIWj34HmdaQnM2K6s1,pauline.crocetti@ardian.com,true,FeUlQjbH834CX2wdcN6uMc5aScTWujNg1Zoj4RIAakTv1P0ltVr4CKzy8CTg+2dRcZEGjp5kz2/YtnIoRnzHpA==,sWahgUW5Rw+R6g==,,,,,,,,,,,,,,,,,,,1611061566202,1612171021516,,,,
sUeOM42NBZUgXJUbLyCuqgtBGw43,nadia.akaouch@ardian.com,true,BMuK7UNIZAMkufCkG+c0Un96b13K6uIFR3Sl9BxBWe0fwm21CJNQRhW+pl2Y8jA7KSLvz1Onx5x1NZ3in18aZg==,/kUi7/SHnYV+eQ==,,,,,,,,,,,,,,,,,,,1620392118198,1620392369101,,,,
sePemTu9c9Ra0cqeMXSl5mN8hrh2,emilio.andrade@ardian.com,true,k7GDIa0lpmOITi+6heGUYEGwjOJJGIKaKY1Y7aQNVrILHlgnelXJak/5ARduI20RBfltPLQqn9BPffwZKBiybw==,jo1/7MmQMBoL0w==,,,,,,,,,,,,,,,,,,,1606504906082,1606504940576,,,,
srDH8BI5AwPzhfKAzxIA6BzgFhC2,daniele.henry@ardian.com,true,EwtK8q2k1HO+q/yiKH/IqKVgmDUI82WT6PAEwRf3LBtpn3l6siZnjokHtrZKRb5SoohLK+G2LBi4n6VQRskYVw==,u0G6nlCd20dK/w==,,,,,,,,,,,,,,,,,,,1606385281774,1606385281774,,,,
st3qju7lM2OHi6t0LgcCUjkdUE32,leopoldo.giandola@ardian.com,true,dToa2Jp4pZO270psmLOhvwP8+urYCCkb30tNwu6NeStCnMKCLDpbIyRuQS0kNdjDOPe5kwiYh0pYS+3L2TSo+g==,1AZpiIoBlvpJ2Q==,,,,,,,,,,,,,,,,,,,1622096590546,1622096590546,,,,
t6ebtWxEsdS0fZUUcYCsecFfZ3l1,nicolas.dietrich@ardian.com,true,ygRYXK+Ve8qwJ+AVzenYlZ06aa6Tho8t0t0X0rijdopaZhYKkYI+lX93ii3madgvq43hRV+oKKTuYf4/ofFjZA==,Jg3K/EesLjpVPA==,,,,,,,,,,,,,,,,,,,1618232567793,1618232567793,,,,
t7WO7hL30iYRrEymEkUcKuXBUCH2,wilfred.small@ardian.com,true,d+WFTotavIqkI6P7XpWsGUd2rDaj/uvgrsiI9l5Q3hQR9b8NTFBm556FkijMjtVqzl5N45FSRIu+2mqSH7eXVA==,StzTLFJBf+E5hA==,,,,,,,,,,,,,,,,,,,1621609067554,1621609083883,,,,
tgmc9croJfTFpl6QpB7cRAhhsCR2,nathalie.jancovic@ardian.com,true,bZD1HLRr0RRR0jmJ8ofVC6eeAkq6n2N2MZk7ebZyXdzNXbmDFeDVi11zlVCDrWS2Hkp7onX/n+b3BX7vGWzx5w==,s3K+Zx+Ulg4RvQ==,,,,,,,,,,,,,,,,,,,1606387020853,1606473110586,,,,
tq18MgJzsegtjxh3bNlE2hXZKlc2,colin.wang@ardian.com,true,6BVc2Ijlsy4gqtF1e7ZVqtrbqKchvlCqPTKuUV820Jx4P/YQnxxzYvuX6JpmnpIe3B9WwQKJDQl+jfzRce7Egg==,0w7+uD/BI2noLQ==,,,,,,,,,,,,,,,,,,,1605171214200,1620983498064,,,,
ttFliAEdVFeKxXNaf0BoaNsFn173,hajar.rabia@ardian.com,true,Zyv/mUYIQa+TeJn1p23AjHTghMlm3lwubpXfqnF3sKeKQfL1fd/vawaYvP74hVHrs7Npi7n67F7iyKGoYQXbGg==,XxIP6N4S24E8+Q==,,,,,,,,,,,,,,,,,,,1620982558932,1620982558932,,,,
tvKqsAaMKFVyixFocDmA7PV3eoI2,marion.calcine@ardian.com,true,g9sc0ZtXowWiHbdvWAqS5BW1TDa/lPmjCPFzm8Lfkw2DjAaUHDPn9XcvdCN/o9jLPJw3cb7hj3wlETbYr7SVcg==,2iXcAvZEuJ+UzQ==,,,,,,,,,,,,,,,,,,,1606820762313,1606820762313,,,,
tznEtdRib2gNgCO9pfOVgIicryf2,tim.fischer@ardian.com,true,zDcG/tkyI48zQfi1ryclmFh8ClocTgA4uR+RT0tc0mC/M/X31//Fxxh9iKtoRt+stSCsfIqWNCbRj+Rx+jsCjA==,D7cIbgLYXIXF3Q==,,,,,,,,,,,,,,,,,,,1621272135296,1621272135296,,,,
u7MxuoJ0ksT91VgWBvQIWg1oeyx1,matthias.straessle@ardian.com,true,AJ/UEVPlqsWHOtxav/q07fKUHGsSccwZT4OTeZRvf5+xLHgoj9/WaiHB7EHl5YmtQERJWLOTw+mTGUt4lcF5WQ==,SZnYHRdXkfxSJA==,,,,,,,,,,,,,,,,,,,1606771075419,1621956814619,,,,
uIi2jfgEENMUpMTaqMu1lL4i80i2,louis.harris@ardian.com,true,Pu0auG1N+T5vPjPpvcEkArtfHWtDD6iJZagagRhrfhFYKMmjNXJ0FybbkK2/3fIegUerKXH9bHJBKcGh7//D0Q==,U9EMmwwzj3pPxQ==,,,,,,,,,,,,,,,,,,,1623752974795,1623752974795,,,,
vLGfx3crGkV6gdBa2ON7oTVji502,philippe.poletti@ardian.com,true,n+D3HB8Q/tz0ADz/sIuYTSyj54ji03ia0cdzTP5hZTwio9sL3iMIIFU+3oy2fTFji90bvvhKVDkQc3MvLrruJg==,hC9cjio90nBFug==,,,,,,,,,,,,,,,,,,,1606845781590,1606845781590,,,,
vhfhmluhcYh2gnbOLKD2vbJv0cw2,artjom.jalosa@ardian.com,true,QchScJf46Lk8EPgIION7Gh9A5iR0pSZm9giTleOXHFspdzgPqTdwXhe7R3+MpxmBsMRu/Qo2Zx1uEffVxyGfvA==,+1e3e+M+c7l3KQ==,,,,,,,,,,,,,,,,,,,1614712133683,1614712133683,,,,
voRQIMo1q5aSJb900adHns1Lypz2,lise.fauconnier@ardian.com,true,z5bkAFm+RIvVREMCrdFX2iL0mCbU5z3976xvwJxJweWUFr5pRSIRABN/r6SUORHSmAzyoX0wyazg0NSMT6ZHjw==,q8tIZIco/napgA==,,,,,,,,,,,,,,,,,,,1621585821760,1621585821760,,,,
vzv9cdLPywVtwR4KWLtjSDLsdf23,claire.desquerre@ardian.com,true,1HzSMtzAXR2OnvrM4X6DLts3DIP4LqPRSB7tBjHeI62uRwAi1WZgbnYdZenC1Ll7g2yZtC1ZB5TbpJeSFtv/bQ==,k6buHZ6bJy2MQg==,,,,,,,,,,,,,,,,,,,1616600671750,1616600671750,,,,
w0jrEMXXPZN3F0XhaRHZ3jJT11Y2,farrah.fedhila@ardian.com,true,Rn1/xa7JlYRhwsApu/eek2atRGooJvWAFaezZnukiYNvcXkULcREldCgDjD/OYPmQnn+4hL3VA6l4cHnofwBkA==,GKk8MbvUn5siXA==,,,,,,,,,,,,,,,,,,,1606759845454,1624994244892,,,,
wI4Uxq1SAQcvU4c8zDRaKMMHqZT2,pierre.casas@ardian.com,true,4Y1ct8nAaxTTHLaQNC0tAF+urO+spYMf9D3j2SUICvZXC5Vd9outvvPmRTDN4MwFZbBsRbG3bopFY+rYSftOpA==,EC8IYFJ58YLB8g==,,,,,,,,,,,,,,,,,,,1613850889177,1613850915930,,,,
wOleFv68hwbIDMWu0MxnmU2kPBu2,brigitte.toribio@ardian.com,true,i8do8BtvO8k+VSo4c1t2WVl5AR5BfEqCJqoDNSNkrnY3sTyYDoMLpWcpCoKQIHDT1ClyX4upgC/maMVfB4J/CQ==,FLegvtE3SdDGww==,,,,,,,,,,,,,,,,,,,1606812254487,1606812254487,,,,
wjlyIA0KOqZ5dM1B6Xmuzr9ZHoe2,jules.ceccato@ardian.com,true,Wvpl6Mzgha2RmF5ljOmUm4CW0QTRTja4KscCQDuQMF4isqQr4PmiZ+W+kPGiassWIuuQ6GLBQ3Zw3/ENu+t7pg==,rNO1XE3++Yfcqw==,,,,,,,,,,,,,,,,,,,1606414163083,1616362188051,,,,
x4rg3FKbt8StTTL08U1mIKox4rH3,chaimaa.boujdi@ardian.com,true,ZwoGrvUtc+TQqcPu11zBmmbZwSo+GO0Z7hR8TxYX46JoJXT5ogk+Rjn0cVOkeSXiIkGLPOgpb8XInhikqToRqg==,3xJ4ioztH2ZL/g==,,,,,,,,,,,,,,,,,,,1618232507297,1618232507297,,,,
xHm0XAPmgOOusl7YpoehfTDZLvc2,daichi.suzuki@ardian.com,true,RmJjt+54H9ZcWCgTxf7MfXyhIPg6+v2Q1HzUhfM1g0yqKPryFsbuOqh0mhTJphDdhiNCVKl5P21p5ERNppziuw==,Zeh67itC7YxX3A==,,,,,,,,,,,,,,,,,,,1606738063265,1606738063265,,,,
xMymHhHbwBcSIvpAwmfIct5AVA92,candice.brenet@ardian.com,true,N6pgv2R9WuW2Tuq+3T05EYL6dF1NqIVzrHefJK1fq2gcMFqP/4trGPgmdPNjcEj/RHK1x3AqnKmADrTeJxUq4w==,Y9QJK4I+6Jkoqw==,,,,,,,,,,,,,,,,,,,1603985538414,1621236486512,,,,
xcqoJAW26wNaLH6GwW1ekuFljZk1,adrien.zervos@ardian.com,true,Qx3LgZySBq8sFdIJWMZuqZENokgNHfNd85FJiK72KJ8OrqTU565Rk46jx7JfOL73zKrs5pPHLY0ppCuLc2Omzw==,T/A2vvbYfVEM2A==,,,,,,,,,,,,,,,,,,,1603205392585,1621352413113,,,,
xfTo9AKMvBbyVagFzenCgggXiF23,andrea.audisio@ardian.com,true,hpmiaz5WSdoA4DgKWCRMun5wcN6aKZsplEFTbvJDz63dtTsQMJ6a5bxafh8m5zk6DHFsHKn0vkkkaQYJlywaeA==,xJb4nAdgmpcwTg==,,,,,,,,,,,,,,,,,,,1621082640791,1621084506943,,,,
xyUeWddPw8SdrYRY66IpBuL8uVl1,tomoaki.naito@ardian.com,true,Atnvonvv7Ku3z69MxyhRSU0Kxt75hrlvWncmATvGjtJqfTblF1dO2lA4qmhygCiWWCKZDaJ/xEbezsj2sX12Kg==,BdJrAYxuYFgTKQ==,,,,,,,,,,,,,,,,,,,1620737954168,1620737954168,,,,
xzmUbvIOdwZ9R8wUNifDCaZZUeA3,christopher.sealey@ardian.com,true,crWv4B+x2FWE8A118AjMfpIJJSQOD4o3O6+aasGlV2YMuFUF5WYf60Bw9IU/tbdCx7GBqc7elRLXzhQhUabr+Q==,HRYANI+6jNUp4A==,,,,,,,,,,,,,,,,,,,1606822316449,1606822351152,,,,
y1Rc0VBtxJTFptzaPspjSSm62n03,catherine.dhullu@ardian.com,true,R2OifbNa3Oml3LudwZnZz4m6tMdUIwAF7XXs2xjNWxmAxvrHJanJWJFwXiyPBzON/Kt5mI+J3C6aI49KvooCgQ==,fmCOgQulV1/dSw==,,,,,,,,,,,,,,,,,,,1606466795525,1606466808797,,,,
y73X0CgE5FgR55o8xAqbu31ATcl1,emily.anderson@ardian.com,true,LDkRj0RFZ8Pe+oAFbb3/0YtLd2cxrWgpch6UzatByc6+DrfKBhdxFXgSPf33GcLPN1bl9z/Nhyxyht89Po3fQQ==,0YKhlLWEEsdthw==,,,,,,,,,,,,,,,,,,,1606398164528,1606398164528,,,,
yAsCgJJJGicNn7Ct1tRYnFqJu7G2,johann.pontida@ardian.com,true,uPyAb+N5vkGRf06xF35QCFr2qA1OT4btEbfq6aQbKgYAPCxfjwQYfS6dwRQTXnnOdwOXyrZqNbsEUiqp+8EMhw==,+/pU4tpASDUu/Q==,,,,,,,,,,,,,,,,,,,1606774200359,1606774200359,,,,
yBuvc9ztIuZo2zRaXvhbW4BuFs32,amandacoleman@ardian.com,false,7zUw4GvujVp8ToIMCwoQqWS/3vmZYy6shv/25XlgbmcGirz/d7Y53CbZo9jF0GVGkSzyTJToeD2rVPCtqgrQ5w==,2lSf3oN6ZVtM1A==,,,,,,,,,,,,,,,,,,,1621889484552,1621913411851,,,,
ym91X2FRdbZUFScZMts1bNQdB0k2,sevil.karaman@ardian.com,true,j9r5KSCP/eYU8IwlIyJyJQSUgS/PpQUqcaiCIaqhD5deG/LyUuTq0937DtJCYDYvaHgqsDGsMr8M9L7edh2zKw==,SlX8MdYH39sIcg==,,,,,,,,,,,,,,,,,,,1608215113076,1618308268274,,,,
ynqLLJH5hNdm7WSWP9OCMouthGK2,celine.maisonnasse@ardian.com,true,jmK7GG1s74jSW3C8B7Xi2QPEzgcktEPhMbevISjgLx1QAWrtcDhs4stvJlh8sG30B/DD2JjN8XI3IQDPDhp2Zg==,03/U6ZLT0kg6+Q==,,,,,,,,,,,,,,,,,,,1606811384039,1606811687888,,,,
yrID7q5FbvUIpwlLPG0ixsQwnuJ3,karine.vuillot@ardian.com,true,EVGbBqe8FPOzVeLJDBAbiLRD61KTsd/aC34kJxQM8cST57zl23YPjV3AvJony8cNvio8RrrZr496UKoFXw2nXQ==,CY/JcLyXtko4Mg==,,,,,,,,,,,,,,,,,,,1621526761930,1621591071016,,,,
zZzbnAs3DyWoagJ9R55rM6MODrp1,lucy.hodgkinson@ardian.com,true,YzlHNNkvM5f/OKJvskpQu1ZXw66auE0slzNxLuW25Pvb6UW61IK9b0SkkcboP6jTUTGoQA/7Mloewlj5wJqLKA==,84Yx80O9JGBAAg==,,,,,,,,,,,,,,,,,,,1608302192555,1608302192555,,,,
