%YAML 1.1
%TAG !u! tag:unity3d.com,2011:
--- !u!114 &11400000
MonoBehaviour:
  m_ObjectHideFlags: 0
  m_CorrespondingSourceObject: {fileID: 0}
  m_PrefabInstance: {fileID: 0}
  m_PrefabAsset: {fileID: 0}
  m_GameObject: {fileID: 0}
  m_Enabled: 1
  m_EditorHideFlags: 0
  m_Script: {fileID: 11500000, guid: 50bdd484204030043864319210a4f68c, type: 3}
  m_Name: new experiment 1
  m_EditorClassIdentifier: 
  profileName: Westdrive Test
  language: ENG
  mainCamera: {fileID: 1432507460423253836, guid: 75cc074df7e73b94b8ddd47c56fea98d,
    type: 3}
  ADVPrefab: {fileID: 1385463903, guid: 90e5db093cf395f40848cf2e6ccf28d5, type: 3}
  ADVModules:
  - {fileID: 11500000, guid: f0174588e8413064aabd8ed8164fab4b, type: 3}
  - {fileID: 11500000, guid: 42ae718578b99274e88976b71eedde96, type: 3}
  - {fileID: 11500000, guid: d80742b88b9f070478ae187a7ad7578e, type: 3}
  ADVPaths:
  - Path_ 1 (Car) - ADV
  - Path_ 2 (Car) - ADV
  - Path_ 3 (Car) - ADV
  eyeTracker: {fileID: 0}
  disabledCarPaths: []
  disabledPedestrianPaths: []
  feedbackDelay: 2
  feedbackOnHalt: 1
  radioTalkEnglish: {fileID: 8300000, guid: 0379bd4c9a235434daf7f985add7be16, type: 3}
  radioTalkGerman: {fileID: 8300000, guid: cf62f3d2c7b1f614b9d47a47991696f3, type: 3}
  taxiDriverMonolougeEnglish: {fileID: 8300000, guid: a5d42d613b9287249b1f5de090225b4c,
    type: 3}
  taxiDriverMonolougeGerman: {fileID: 8300000, guid: a5d42d613b9287249b1f5de090225b4c,
    type: 3}
  randomizeADVPath: 1
  randomizeADVModules: 1
  reuseADVPath: 0
  useEyetracking: 0
  endTriggerOnPath: 0.95
  useHashValidation: 1
