Int A, B, C, D, E, F;
Read A, B, C, D;
If A==C && B==D
     If A<B || B<C
             If A>0 && B>0 && C>0 && D>0
                  E=sqrt(A*A + B*B);
                   F= sqrt(C*C + D*D);
                       If E==F
                             Write “Este dreptunghi”;
                        Else
                                 Write “Nu este dreptunghi”;
                  Else
                        Write “Imposibil”
         Else
               Write “Nu este dreptunghi”;

Number r, h, v;
          If ABCD dreptunghi
                    If A>B
                          r=B/2
                           h=A
                            v= pi * pow(r, 2) *h;
                            write v;
                      else 
                             r= A/2;
	h=B;
                              v= pi * pow(r, 2) *h;
                              write v;
                      else
                           write “Nu este cilindru”;
