<svg width="39" height="39" viewBox="0 0 39 39" fill="none" xmlns="http://www.w3.org/2000/svg">
<circle cx="15" cy="25" r="5" fill="#354158"/>
<mask id="mask0" mask-type="alpha" maskUnits="userSpaceOnUse" x="8" y="8" width="23" height="23">
<path fill-rule="evenodd" clip-rule="evenodd" d="M27.9211 8.51807L30.6426 27.882L11.2786 30.6034L8.55722 11.2395L27.9211 8.51807Z" fill="white"/>
</mask>
<g mask="url(#mask0)">
<path fill-rule="evenodd" clip-rule="evenodd" d="M17.0781 22.9072C15.8511 21.9826 14.0907 22.23 13.166 23.457C12.2414 24.684 12.4888 26.4445 13.7159 27.3691C14.9429 28.2937 16.7033 28.0463 17.628 26.8193C18.5526 25.5923 18.3052 23.8318 17.0781 22.9072V22.9072ZM22.0899 30.1816C24.8722 26.4894 24.1327 21.2276 20.4404 18.4453C16.7482 15.663 11.4864 16.4025 8.70413 20.0947C6.83806 22.5711 6.56548 25.741 7.68799 28.4058L10.2661 27.3054C9.52705 25.5243 9.69104 23.4268 10.9351 21.7759C12.7928 19.3107 16.2941 18.8186 18.7593 20.6762C21.2245 22.5339 21.7166 26.0352 19.8589 28.5004C18.6149 30.1514 16.6438 30.8871 14.728 30.6677L14.3809 33.4492C17.2518 33.7937 20.2238 32.658 22.0899 30.1816V30.1816ZM23.8027 13.9834C17.6453 9.3434 8.88218 10.575 4.24222 16.7324C1.1321 20.8597 0.667561 26.1411 2.53749 30.5758L5.10716 29.4866C3.62072 25.9355 3.98508 21.7154 6.47317 18.4136C10.1885 13.4832 17.1912 12.499 22.1216 16.2143C27.052 19.9297 28.0362 26.9323 24.3208 31.8627C21.8327 35.1646 17.8765 36.678 14.0421 36.2196L13.7034 38.9899C18.4929 39.5734 23.4417 37.6712 26.5518 33.5439C31.1917 27.3864 29.9602 18.6233 23.8027 13.9834V13.9834Z" fill="#1F8EFA"/>
</g>
</svg>
