<?xml version="1.0" encoding="UTF-8"?>
<svg width="77px" height="244px" viewBox="0 0 77 244" version="1.1" xmlns="http://www.w3.org/2000/svg" xmlns:xlink="http://www.w3.org/1999/xlink">
    <!-- Generator: Sketch 58 (84663) - https://sketch.com -->
    <title>img_3</title>
    <desc>Created with Sketch.</desc>
    <defs>
        <path d="M0.366454,0.8822856 C-0.503378366,10.4833551 0.89710673,14.853216 3.066217,23.1011146 C11.4000004,23 14.3,27 26.182693,23.4595905 C26.3812904,18.9888277 26.0556717,14.5747774 24.389658,11.1014215 C24.389658,11.1014215 25.6199102,10.4110282 26.5006838,10.4110282 C27.3814575,10.4110282 28.610342,11.1014215 28.610342,11.1014215 C26.948699,14.5656651 26.6211029,18.9656738 26.81606,23.4244047 C37.7000005,27 40.5999999,23 49.935151,23.1011146 C52.1042613,14.853216 53.504746,10.4833551 52.633546,0.8822856 C52.5999999,1 39.141974,3.74682972 26.5,3.74682972 C13.858026,3.74682972 0.40000015,1 0.366454,0.8822856 Z" id="path-1"></path>
        <path d="M3.73622,0.979134384 C3.74579363,5.51205955 2.11875677,11.7453248 0.786655,14.166304 C-0.468173924,16.448547 12.765913,19.5896685 23.5,19.5896685 C34.234087,19.5896685 47.4681739,16.448547 46.213345,14.166304 C44.8826109,11.7453248 43.2542064,5.51205955 43.26378,0.979134384 C43.4999999,1 31.1342834,2.96803331 23.5,2.96803331 C15.8657166,2.96803331 3.50000006,1 3.73622,0.979134384 Z" id="path-3"></path>
    </defs>
    <g id="new_1400" stroke="none" stroke-width="1" fill="none" fill-rule="evenodd">
        <g id="007_data_analytics" transform="translate(-636.000000, -615.000000)">
            <g id="Group-13" transform="translate(70.000000, 482.000000)">
                <g id="Group-28" transform="translate(536.000000, 103.000000)">
                    <g id="img_3" transform="translate(30.000000, 30.000000)">
                        <path d="M76.2539375,127.173076 C76.3294056,125.714703 75.6994132,124.614018 75.6976011,121.050274 C75.6943688,117.487845 74.2222097,104.542641 73.7393746,98.1292164 C73.2575778,91.7157914 71.5549184,88.7372374 71.2651754,84.1056846 C70.9772687,79.4741318 69.9262704,68.2305838 70.2782556,57.8326031 C70.4079468,53.9966464 68.6016894,51.4967652 66.8230667,50.0712674 C63.9509268,47.7686413 58.6554171,47.717355 55.6388288,46.9954008 C52.9272183,46.3470887 51.1443637,44.9820825 49.4789542,44.5599563 C48.6539476,44.3508657 47.2262598,43.794606 46.6867537,43.2081004 C46.085136,42.5545281 45.1271461,41.6340037 44.4705565,37.1352694 C45.5479776,36.1897594 46.5061824,35.0732948 47.2737542,33.9594603 C48.3434237,32.4077191 49.1055656,31.0229874 49.6756994,29.5659288 C49.9524313,28.85844 50.4813875,28.2837698 51.1345078,27.8590135 C51.1372556,27.8563835 51.1413803,27.8537534 51.1441312,27.8524384 C52.5022625,26.9595297 52.5345353,26.6649619 52.7440644,25.2105333 C52.844057,24.5161949 54.0390411,21.3627413 53.0119826,20.4579973 C52.3146079,19.8438761 51.5528936,20.408026 51.4323085,20.0122005 C51.5139305,17.9502259 51.3591976,15.8987715 50.7131619,13.9604101 C49.3810685,9.96533418 47.8545154,6.56859913 43.3423375,5.22200343 C43.3623401,4.59999194 43.2932282,3.97403535 43.1172515,3.3875298 C42.7118254,2.03435893 41.7820269,0.911319159 40.6432848,0.398455563 C39.9609663,0.0907374054 39.2349227,7.10542736e-14 38.5006849,7.10542736e-14 C37.7664471,7.10542736e-14 37.0404036,0.0907374054 36.3580852,0.398455563 C35.2179731,0.911319159 34.289545,2.03435893 33.8841192,3.3875298 C33.7081426,3.97403535 33.6376599,4.59999194 33.6590337,5.22200343 C29.1468561,6.56859913 27.6189315,9.96533418 26.2868381,13.9604101 C25.6408024,15.8987715 25.4860695,17.9502259 25.5690665,20.0122005 C25.4484815,20.408026 24.6853921,19.8438761 23.9880174,20.4579973 C22.9609589,21.3627413 24.155943,24.5161949 24.2559356,25.2105333 C24.4654647,26.6649619 24.4977375,26.9595297 25.8558688,27.8524384 C25.8599966,27.8537534 25.8627444,27.8563835 25.8668692,27.8590135 C26.5199896,28.2837698 27.0475687,28.85844 27.3243006,29.5659288 C27.8958122,31.0229874 28.6565763,32.4077191 29.7262458,33.9594603 C30.4938176,35.0732948 31.4520224,36.1897594 32.5308229,37.1352694 C31.8728539,41.6340037 30.914864,42.5545281 30.3146272,43.2081004 C29.7751213,43.794606 28.3460524,44.3508657 27.522427,44.5599563 C25.8570177,44.9820825 24.0741634,46.3470887 21.3611712,46.9954008 C18.3445829,47.717355 13.0490732,47.7686413 10.1783159,50.0712674 C8.3996936,51.4967652 6.59343689,53.9966464 6.72312907,57.8326031 C7.07372955,68.2305838 6.02412152,79.4741318 5.73482463,84.1056846 C5.44508164,88.7372374 3.74242222,91.7157914 3.26062539,98.1292164 C2.77918688,104.542641 1.30563122,117.487845 1.30379974,121.050274 C1.30058677,124.614018 0.670594386,125.714703 0.747464958,127.173076 C0.824390901,128.630135 0.515476577,128.471016 0.162508504,131.202343 C-0.190792606,133.933671 0.036688786,137.536866 0.798942868,140.707415 C1.27889498,142.701008 2.12116947,143.998947 3.61074577,145.352118 C3.85977969,145.578304 5.09984444,146.442282 6.36469113,146.986707 C6.88418697,147.208947 7.13772323,146.931475 7.59628956,146.980131 C8.12379564,147.035363 8.83694438,147.381217 9.09787084,147.020897 C9.67208615,146.225301 6.4259801,143.72279 5.90162568,142.719418 C5.37887121,141.716047 5.4356685,140.457558 5.67823772,138.4495 C5.92063041,136.442757 6.63416433,134.768718 7.04441094,135.718173 C7.28286767,136.269172 7.22499811,137.30279 6.99253796,138.880832 C6.82433331,140.020967 6.63691316,141.311016 7.09862061,141.956698 C7.82695424,142.97848 8.7439437,141.946178 8.88145757,141.218964 C9.40370564,138.45213 9.37195421,138.079975 9.84872333,136.658423 C10.7045711,134.107255 10.6521021,132.274097 9.50906965,130.492224 C8.36818229,128.711667 7.64614469,127.642544 7.5937022,125.504297 C7.5427041,123.367365 7.21587624,123.663248 7.63800929,120.634723 C8.06109391,117.606198 9.03532409,111.836398 12.1961622,102.514116 C15.3477586,93.1905189 14.3185581,92.7065861 14.5142595,86.8875569 C14.6599007,82.5689824 17.7511057,74.9556721 18.3026289,69.7205183 C18.3779246,72.2401251 17.3609291,75.7999244 18.3242185,79.0204448 C19.8428489,84.0912192 18.8710862,89.964333 18.8663507,93.9791344 C18.8597612,98.5120596 17.1679031,106.745325 15.7969669,109.166304 C13.2108481,113.73079 12.8659375,119.368344 12.3284129,124.882286 C11.3893647,134.483355 12.8068997,138.853216 15.0006145,147.101115 C17.540156,156.616707 17.3823868,166.758256 17.7515527,171.889522 C18.0487459,176.014786 15.4491618,180.170296 15.4080232,190.035688 C15.3586097,201.885467 19.6901119,202.031436 23.5045231,228.896283 C24.267997,234.237955 22.7044356,236.014567 21.8178647,237.378258 C20.9308626,238.741949 18.3220751,241.139258 18.2577296,241.908553 C18.1919399,242.676533 17.1019465,243.860065 21.1382071,243.860065 C25.3119698,243.860065 27.4555879,244.141482 28.3031281,243.593113 C28.4967047,243.468184 28.7716348,243.499745 28.9403739,243.653604 C29.2221038,243.910036 29.7015898,244.128332 30.7203157,243.911351 C31.6931187,243.703576 32.1808083,243.069729 32.1433989,241.963784 C32.1212611,241.287856 32.1732429,240.897291 32.319161,239.694034 C32.4895678,238.281687 31.837729,237.741207 32.1974047,235.979061 C32.7120606,233.462084 29.3372914,231.486902 34.6715011,207.742632 C37.6108138,194.575188 34.9823573,191.06799 34.0784735,185.884123 C32.867977,178.913123 32.3345324,175.916158 33.9852233,167.894446 C34.7011139,164.413549 41.5746887,145.523073 36.435575,135.101422 C36.435575,135.101422 37.5963475,134.411028 38.5007021,134.411028 C39.4050568,134.411028 40.564425,135.101422 40.564425,135.101422 C35.4253113,145.523073 42.300298,164.413549 43.0147767,167.894446 C44.6668825,175.916158 44.1334387,178.913123 42.9215265,185.884123 C42.0190614,191.06799 39.3906059,194.575188 42.3299219,207.742632 C47.6641377,231.486902 44.2879394,233.462084 44.8025953,235.979061 C45.162271,237.741207 44.5104322,238.281687 44.6822702,239.694034 C44.8267571,240.897291 44.8801705,241.287856 44.8566011,241.963784 C44.8191917,243.069729 45.3083136,243.703576 46.2796843,243.911351 C47.2984102,244.128332 47.7778962,243.910036 48.0596261,243.653604 C48.2283652,243.499745 48.5032953,243.468184 48.6983042,243.593113 C49.5444121,244.141482 51.6880302,243.860065 55.8617929,243.860065 C59.8980535,243.860065 58.8080601,242.676533 58.7437022,241.908553 C58.6779249,241.139258 56.0691374,238.741949 55.1821353,237.378258 C54.2969947,236.014567 52.7334328,234.237955 53.4954769,228.896283 C57.3098881,202.031436 61.6428119,201.885467 61.5933954,190.035688 C61.5522542,180.170296 58.9512541,176.014786 59.2484473,171.889522 C59.6190258,166.758256 59.4612539,156.616707 62.000793,147.101115 C64.1945057,138.853216 65.6120396,134.483355 64.6715871,124.882286 C64.1340625,119.368344 63.7891519,113.73079 61.2030331,109.166304 C59.8334941,106.745325 58.1402388,98.5120596 58.1336493,93.9791344 C58.1289138,89.964333 57.1571511,84.0912192 58.6771716,79.0204448 C59.6390709,75.7999244 58.6220754,72.2401251 58.6973711,69.7205183 C59.2488943,74.9556721 62.335709,81.5689824 62.4813269,85.8875569 C62.6783904,91.7065861 61.6493795,92.1905189 64.7990116,101.514116 C67.9592789,110.836398 68.9389061,117.606198 69.3619907,120.634723 C69.7841238,123.663248 69.4586973,123.367365 69.4062978,125.504297 C69.3552579,127.642544 68.6318177,128.711667 67.4909303,130.492224 C66.3478979,132.274097 66.2954289,134.107255 67.1512767,136.658423 C67.629451,138.079975 67.5962944,138.45213 68.1185424,141.218964 C68.2560563,141.946178 69.1730458,142.97848 69.9027856,141.956698 C70.3630868,141.311016 70.1756667,140.020967 70.007462,138.880832 C69.7764069,137.30279 69.7185371,136.269172 69.9569937,135.718173 C70.36724,134.768718 71.0793696,136.442757 71.3217623,138.4495 C71.5643315,140.457558 71.6225349,141.716047 71.0983743,142.719418 C70.5740199,143.72279 67.3293212,146.225301 67.9035367,147.020897 C68.1630556,147.381217 68.8762044,147.035363 69.4037104,146.980131 C69.8636843,146.931475 70.1172206,147.208947 70.6353089,146.986707 C71.9001556,146.442282 73.1402203,145.578304 73.3892542,145.352118 C74.8788305,143.998947 75.721105,142.701008 76.2010571,140.707415 C76.9633112,137.536866 77.1907926,133.933671 76.8374915,131.202343 C76.5672258,129.111212 76.1450903,129.274929 76.2539375,127.173076 Z" id="Fill-6-Copy" fill="#E4E7EF"></path>
                        <g id="Group-26" transform="translate(12.000000, 124.000000)">
                            <mask id="mask-2" fill="white">
                                <use xlink:href="#path-1"></use>
                            </mask>
                            <use id="Mask" fill="#D3DDF5" xlink:href="#path-1"></use>
                            <g opacity="0.07" mask="url(#mask-2)" stroke="#000000">
                                <g transform="translate(-51.000000, -39.000000)">
                                    <path d="M40,70 L110,0" id="Path-10"></path>
                                    <path d="M50,70 L120,0" id="Path-10-Copy-5"></path>
                                    <path d="M60,70 L130,0" id="Path-10-Copy-6"></path>
                                    <path d="M70,70 L140,0" id="Path-10-Copy-7"></path>
                                    <path d="M80,70 L150,0" id="Path-10-Copy-8"></path>
                                    <path d="M90,70 L160,0" id="Path-10-Copy-9"></path>
                                    <path d="M100,70 L170,0" id="Path-10-Copy-10"></path>
                                    <path d="M30,70 L100,0" id="Path-10-Copy"></path>
                                    <path d="M20,70 L90,0" id="Path-10-Copy-2"></path>
                                    <path d="M10,70 L80,0" id="Path-10-Copy-3"></path>
                                    <path d="M0,70 L70,0" id="Path-10-Copy-4"></path>
                                </g>
                            </g>
                        </g>
                        <g id="Group-26" transform="translate(15.000000, 95.000000)">
                            <mask id="mask-4" fill="white">
                                <use xlink:href="#path-3"></use>
                            </mask>
                            <use id="Mask" fill="#D3DDF5" xlink:href="#path-3"></use>
                            <g opacity="0.07" mask="url(#mask-4)" stroke="#000000">
                                <g transform="translate(-42.000000, -42.000000)">
                                    <path d="M40,70 L110,0" id="Path-10"></path>
                                    <path d="M50,70 L120,0" id="Path-10-Copy-5"></path>
                                    <path d="M60,70 L130,0" id="Path-10-Copy-6"></path>
                                    <path d="M70,70 L140,0" id="Path-10-Copy-7"></path>
                                    <path d="M80,70 L150,0" id="Path-10-Copy-8"></path>
                                    <path d="M90,70 L160,0" id="Path-10-Copy-9"></path>
                                    <path d="M100,70 L170,0" id="Path-10-Copy-10"></path>
                                    <path d="M30,70 L100,0" id="Path-10-Copy"></path>
                                    <path d="M20,70 L90,0" id="Path-10-Copy-2"></path>
                                    <path d="M10,70 L80,0" id="Path-10-Copy-3"></path>
                                    <path d="M0,70 L70,0" id="Path-10-Copy-4"></path>
                                </g>
                            </g>
                        </g>
                    </g>
                </g>
            </g>
        </g>
    </g>
</svg>