<?xml version="1.0" encoding="utf-8"?>
<!-- Generator: Adobe Illustrator 16.0.0, SVG Export Plug-In . SVG Version: 6.00 Build 0)  -->
<!DOCTYPE svg PUBLIC "-//W3C//DTD SVG 1.1//EN" "http://www.w3.org/Graphics/SVG/1.1/DTD/svg11.dtd">
<svg version="1.1" xmlns="http://www.w3.org/2000/svg" xmlns:xlink="http://www.w3.org/1999/xlink" x="0px" y="0px"
	 width="171.084px" height="169.879px" viewBox="0 0 171.084 169.879" enable-background="new 0 0 171.084 169.879"
	 xml:space="preserve">
<g id="Layer_1" display="none">
	
		<circle display="inline" fill="none" stroke="#3C4852" stroke-width="2" stroke-miterlimit="10" cx="152.439" cy="148.163" r="3.368"/>
	
		<circle display="inline" fill="none" stroke="#3C4852" stroke-width="2" stroke-miterlimit="10" cx="139.811" cy="148.163" r="3.368"/>
	
		<circle display="inline" fill="none" stroke="#3C4852" stroke-width="2" stroke-miterlimit="10" cx="127.183" cy="148.163" r="3.367"/>
	
		<circle display="inline" fill="none" stroke="#3C4852" stroke-width="2" stroke-miterlimit="10" cx="34.43" cy="148.163" r="3.368"/>
	
		<circle display="inline" fill="none" stroke="#3C4852" stroke-width="2" stroke-miterlimit="10" cx="21.802" cy="148.163" r="3.368"/>
	
		<circle display="inline" fill="none" stroke="#3C4852" stroke-width="2" stroke-miterlimit="10" cx="152.439" cy="135.534" r="3.368"/>
	
		<circle display="inline" fill="none" stroke="#3C4852" stroke-width="2" stroke-miterlimit="10" cx="139.811" cy="135.534" r="3.368"/>
	
		<circle display="inline" fill="none" stroke="#3C4852" stroke-width="2" stroke-miterlimit="10" cx="127.183" cy="135.534" r="3.367"/>
	
		<circle display="inline" fill="none" stroke="#3C4852" stroke-width="2" stroke-miterlimit="10" cx="34.43" cy="135.534" r="3.368"/>
	
		<circle display="inline" fill="none" stroke="#3C4852" stroke-width="2" stroke-miterlimit="10" cx="21.802" cy="135.534" r="3.368"/>
	
		<circle display="inline" fill="none" stroke="#3C4852" stroke-width="2" stroke-miterlimit="10" cx="152.439" cy="122.906" r="3.368"/>
	
		<circle display="inline" fill="none" stroke="#3C4852" stroke-width="2" stroke-miterlimit="10" cx="139.811" cy="122.906" r="3.368"/>
	
		<circle display="inline" fill="none" stroke="#3C4852" stroke-width="2" stroke-miterlimit="10" cx="127.183" cy="122.906" r="3.367"/>
	
		<circle display="inline" fill="none" stroke="#3C4852" stroke-width="2" stroke-miterlimit="10" cx="59.688" cy="122.906" r="3.368"/>
	
		<circle display="inline" fill="none" stroke="#3C4852" stroke-width="2" stroke-miterlimit="10" cx="47.059" cy="122.906" r="3.368"/>
	
		<circle display="inline" fill="none" stroke="#3C4852" stroke-width="2" stroke-miterlimit="10" cx="34.43" cy="122.906" r="3.368"/>
	
		<circle display="inline" fill="none" stroke="#3C4852" stroke-width="2" stroke-miterlimit="10" cx="21.802" cy="122.906" r="3.368"/>
	
		<circle display="inline" fill="none" stroke="#3C4852" stroke-width="2" stroke-miterlimit="10" cx="152.439" cy="110.278" r="3.368"/>
	
		<circle display="inline" fill="none" stroke="#3C4852" stroke-width="2" stroke-miterlimit="10" cx="139.811" cy="110.278" r="3.368"/>
	
		<circle display="inline" fill="none" stroke="#3C4852" stroke-width="2" stroke-miterlimit="10" cx="127.183" cy="110.278" r="3.367"/>
	
		<circle display="inline" fill="none" stroke="#3C4852" stroke-width="2" stroke-miterlimit="10" cx="59.688" cy="110.278" r="3.368"/>
	
		<circle display="inline" fill="none" stroke="#3C4852" stroke-width="2" stroke-miterlimit="10" cx="47.059" cy="110.278" r="3.368"/>
	
		<circle display="inline" fill="none" stroke="#3C4852" stroke-width="2" stroke-miterlimit="10" cx="34.43" cy="110.278" r="3.368"/>
	
		<circle display="inline" fill="none" stroke="#3C4852" stroke-width="2" stroke-miterlimit="10" cx="21.802" cy="110.278" r="3.368"/>
	<g display="inline">
		<g>
			
				<line fill="none" stroke="#F7B01E" stroke-width="2" stroke-linecap="round" stroke-linejoin="round" stroke-miterlimit="10" x1="96.185" y1="106.762" x2="96.185" y2="106.762"/>
			
				<line fill="none" stroke="#F7B01E" stroke-width="2" stroke-linecap="round" stroke-linejoin="round" stroke-miterlimit="10" x1="96.185" y1="106.762" x2="96.185" y2="106.762"/>
			
				<line fill="none" stroke="#F7B01E" stroke-width="2" stroke-linecap="round" stroke-linejoin="round" stroke-miterlimit="10" x1="96.185" y1="106.762" x2="96.185" y2="106.762"/>
			
				<line fill="none" stroke="#F7B01E" stroke-width="2" stroke-linecap="round" stroke-linejoin="round" stroke-miterlimit="10" x1="96.185" y1="54.265" x2="96.185" y2="106.762"/>
			
				<line fill="none" stroke="#F7B01E" stroke-width="2" stroke-linecap="round" stroke-linejoin="round" stroke-miterlimit="10" x1="96.185" y1="106.762" x2="96.185" y2="106.762"/>
			
				<line fill="none" stroke="#F7B01E" stroke-width="2" stroke-linecap="round" stroke-linejoin="round" stroke-miterlimit="10" x1="96.185" y1="106.762" x2="96.185" y2="106.762"/>
			
				<line fill="none" stroke="#F7B01E" stroke-width="2" stroke-linecap="round" stroke-linejoin="round" stroke-miterlimit="10" x1="96.185" y1="106.762" x2="96.185" y2="106.762"/>
			
				<line fill="none" stroke="#F7B01E" stroke-width="2" stroke-linecap="round" stroke-linejoin="round" stroke-miterlimit="10" x1="96.185" y1="106.762" x2="96.185" y2="106.762"/>
			<path fill="none" stroke="#F7B01E" stroke-width="2" stroke-linecap="round" stroke-linejoin="round" stroke-miterlimit="10" d="
				M96.185,106.762"/>
			
				<line fill="none" stroke="#F7B01E" stroke-width="2" stroke-linecap="round" stroke-linejoin="round" stroke-miterlimit="10" x1="96.185" y1="106.762" x2="96.185" y2="106.762"/>
			
				<line fill="none" stroke="#F7B01E" stroke-width="2" stroke-linecap="round" stroke-linejoin="round" stroke-miterlimit="10" x1="96.185" y1="106.762" x2="96.185" y2="106.762"/>
			
				<line fill="none" stroke="#F7B01E" stroke-width="2" stroke-linecap="round" stroke-linejoin="round" stroke-miterlimit="10" x1="96.185" y1="106.762" x2="96.185" y2="106.762"/>
			
				<line fill="none" stroke="#F7B01E" stroke-width="2" stroke-linecap="round" stroke-linejoin="round" stroke-miterlimit="10" x1="96.185" y1="106.762" x2="96.185" y2="106.762"/>
			
				<line fill="none" stroke="#F7B01E" stroke-width="2" stroke-linecap="round" stroke-linejoin="round" stroke-miterlimit="10" x1="96.185" y1="106.762" x2="96.185" y2="106.762"/>
			
				<line fill="none" stroke="#F7B01E" stroke-width="2" stroke-linecap="round" stroke-linejoin="round" stroke-miterlimit="10" x1="96.185" y1="106.762" x2="96.185" y2="106.762"/>
			
				<line fill="none" stroke="#F7B01E" stroke-width="2" stroke-linecap="round" stroke-linejoin="round" stroke-miterlimit="10" x1="106.408" y1="89.054" x2="96.185" y2="106.762"/>
			<path fill="none" stroke="#F7B01E" stroke-width="2" stroke-linecap="round" stroke-linejoin="round" stroke-miterlimit="10" d="
				M96.185,106.762"/>
			
				<line fill="none" stroke="#F7B01E" stroke-width="2" stroke-linecap="round" stroke-linejoin="round" stroke-miterlimit="10" x1="96.185" y1="106.762" x2="96.185" y2="106.762"/>
			
				<line fill="none" stroke="#F7B01E" stroke-width="2" stroke-linecap="round" stroke-linejoin="round" stroke-miterlimit="10" x1="96.185" y1="106.762" x2="96.185" y2="106.762"/>
			
				<line fill="none" stroke="#F7B01E" stroke-width="2" stroke-linecap="round" stroke-linejoin="round" stroke-miterlimit="10" x1="96.185" y1="106.762" x2="96.185" y2="106.762"/>
			
				<line fill="none" stroke="#F7B01E" stroke-width="2" stroke-linecap="round" stroke-linejoin="round" stroke-miterlimit="10" x1="96.185" y1="106.762" x2="96.185" y2="106.762"/>
			
				<line fill="none" stroke="#F7B01E" stroke-width="2" stroke-linecap="round" stroke-linejoin="round" stroke-miterlimit="10" x1="96.185" y1="106.762" x2="96.185" y2="106.762"/>
			
				<line fill="none" stroke="#F7B01E" stroke-width="2" stroke-linecap="round" stroke-linejoin="round" stroke-miterlimit="10" x1="96.185" y1="106.762" x2="96.185" y2="106.762"/>
			
				<line fill="none" stroke="#F7B01E" stroke-width="2" stroke-linecap="round" stroke-linejoin="round" stroke-miterlimit="10" x1="96.185" y1="106.762" x2="96.185" y2="106.762"/>
			
				<line fill="none" stroke="#F7B01E" stroke-width="2" stroke-linecap="round" stroke-linejoin="round" stroke-miterlimit="10" x1="96.185" y1="106.762" x2="96.185" y2="106.762"/>
			<path fill="none" stroke="#F7B01E" stroke-width="2" stroke-linecap="round" stroke-linejoin="round" stroke-miterlimit="10" d="
				M96.185,106.762"/>
			
				<line fill="none" stroke="#F7B01E" stroke-width="2" stroke-linecap="round" stroke-linejoin="round" stroke-miterlimit="10" x1="96.185" y1="106.762" x2="96.185" y2="106.762"/>
			
				<line fill="none" stroke="#F7B01E" stroke-width="2" stroke-linecap="round" stroke-linejoin="round" stroke-miterlimit="10" x1="113.892" y1="96.538" x2="96.185" y2="106.762"/>
			
				<line fill="none" stroke="#F7B01E" stroke-width="2" stroke-linecap="round" stroke-linejoin="round" stroke-miterlimit="10" x1="96.185" y1="106.762" x2="96.185" y2="106.762"/>
			
				<line fill="none" stroke="#F7B01E" stroke-width="2" stroke-linecap="round" stroke-linejoin="round" stroke-miterlimit="10" x1="96.185" y1="106.762" x2="96.185" y2="106.762"/>
			
				<line fill="none" stroke="#F7B01E" stroke-width="2" stroke-linecap="round" stroke-linejoin="round" stroke-miterlimit="10" x1="96.185" y1="106.762" x2="96.185" y2="106.762"/>
			
				<line fill="none" stroke="#F7B01E" stroke-width="2" stroke-linecap="round" stroke-linejoin="round" stroke-miterlimit="10" x1="96.185" y1="106.762" x2="96.185" y2="106.762"/>
			
				<line fill="none" stroke="#F7B01E" stroke-width="2" stroke-linecap="round" stroke-linejoin="round" stroke-miterlimit="10" x1="96.185" y1="106.762" x2="96.185" y2="106.762"/>
			
				<line fill="none" stroke="#F7B01E" stroke-width="2" stroke-linecap="round" stroke-linejoin="round" stroke-miterlimit="10" x1="96.185" y1="106.762" x2="96.185" y2="106.762"/>
			
				<line fill="none" stroke="#F7B01E" stroke-width="2" stroke-linecap="round" stroke-linejoin="round" stroke-miterlimit="10" x1="96.185" y1="106.762" x2="96.185" y2="106.762"/>
			
				<line fill="none" stroke="#F7B01E" stroke-width="2" stroke-linecap="round" stroke-linejoin="round" stroke-miterlimit="10" x1="96.185" y1="106.762" x2="96.185" y2="106.762"/>
			
				<line fill="none" stroke="#F7B01E" stroke-width="2" stroke-linecap="round" stroke-linejoin="round" stroke-miterlimit="10" x1="96.185" y1="106.762" x2="96.185" y2="106.762"/>
			
				<line fill="none" stroke="#F7B01E" stroke-width="2" stroke-linecap="round" stroke-linejoin="round" stroke-miterlimit="10" x1="96.185" y1="106.762" x2="96.185" y2="106.762"/>
			
				<line fill="none" stroke="#F7B01E" stroke-width="2" stroke-linecap="round" stroke-linejoin="round" stroke-miterlimit="10" x1="96.185" y1="106.762" x2="96.185" y2="106.762"/>
			
				<line fill="none" stroke="#F7B01E" stroke-width="2" stroke-linecap="round" stroke-linejoin="round" stroke-miterlimit="10" x1="96.185" y1="106.762" x2="96.185" y2="106.762"/>
			
				<line fill="none" stroke="#F7B01E" stroke-width="2" stroke-linecap="round" stroke-linejoin="round" stroke-miterlimit="10" x1="96.185" y1="106.762" x2="96.185" y2="106.762"/>
			
				<line fill="none" stroke="#F7B01E" stroke-width="2" stroke-linecap="round" stroke-linejoin="round" stroke-miterlimit="10" x1="96.185" y1="106.762" x2="96.185" y2="106.762"/>
			
				<line fill="none" stroke="#F7B01E" stroke-width="2" stroke-linecap="round" stroke-linejoin="round" stroke-miterlimit="10" x1="96.185" y1="106.762" x2="96.185" y2="106.762"/>
			<path fill="none" stroke="#F7B01E" stroke-width="2" stroke-linecap="round" stroke-linejoin="round" stroke-miterlimit="10" d="
				M96.185,106.763"/>
			
				<line fill="none" stroke="#F7B01E" stroke-width="2" stroke-linecap="round" stroke-linejoin="round" stroke-miterlimit="10" x1="85.962" y1="89.054" x2="96.185" y2="106.762"/>
			
				<line fill="none" stroke="#F7B01E" stroke-width="2" stroke-linecap="round" stroke-linejoin="round" stroke-miterlimit="10" x1="96.185" y1="106.762" x2="96.185" y2="106.763"/>
			
				<line fill="none" stroke="#F7B01E" stroke-width="2" stroke-linecap="round" stroke-linejoin="round" stroke-miterlimit="10" x1="96.185" y1="106.762" x2="96.185" y2="106.762"/>
			
				<line fill="none" stroke="#F7B01E" stroke-width="2" stroke-linecap="round" stroke-linejoin="round" stroke-miterlimit="10" x1="96.185" y1="106.762" x2="96.185" y2="106.762"/>
			
				<line fill="none" stroke="#F7B01E" stroke-width="2" stroke-linecap="round" stroke-linejoin="round" stroke-miterlimit="10" x1="96.185" y1="106.762" x2="96.185" y2="106.762"/>
			
				<line fill="none" stroke="#F7B01E" stroke-width="2" stroke-linecap="round" stroke-linejoin="round" stroke-miterlimit="10" x1="96.185" y1="106.762" x2="96.185" y2="106.762"/>
			
				<line fill="none" stroke="#F7B01E" stroke-width="2" stroke-linecap="round" stroke-linejoin="round" stroke-miterlimit="10" x1="96.185" y1="106.762" x2="96.185" y2="106.762"/>
			<path fill="none" stroke="#F7B01E" stroke-width="2" stroke-linecap="round" stroke-linejoin="round" stroke-miterlimit="10" d="
				M96.185,106.762"/>
			
				<line fill="none" stroke="#F7B01E" stroke-width="2" stroke-linecap="round" stroke-linejoin="round" stroke-miterlimit="10" x1="96.185" y1="106.762" x2="96.185" y2="106.762"/>
			
				<line fill="none" stroke="#F7B01E" stroke-width="2" stroke-linecap="round" stroke-linejoin="round" stroke-miterlimit="10" x1="78.478" y1="96.538" x2="96.185" y2="106.762"/>
			
				<line fill="none" stroke="#F7B01E" stroke-width="2" stroke-linecap="round" stroke-linejoin="round" stroke-miterlimit="10" x1="96.185" y1="106.762" x2="96.185" y2="106.762"/>
			
				<line fill="none" stroke="#F7B01E" stroke-width="2" stroke-linecap="round" stroke-linejoin="round" stroke-miterlimit="10" x1="96.185" y1="106.762" x2="96.185" y2="106.762"/>
			
				<line fill="none" stroke="#F7B01E" stroke-width="2" stroke-linecap="round" stroke-linejoin="round" stroke-miterlimit="10" x1="96.185" y1="106.762" x2="96.185" y2="106.762"/>
			
				<line fill="none" stroke="#F7B01E" stroke-width="2" stroke-linecap="round" stroke-linejoin="round" stroke-miterlimit="10" x1="96.185" y1="106.762" x2="96.185" y2="106.762"/>
			
				<line fill="none" stroke="#F7B01E" stroke-width="2" stroke-linecap="round" stroke-linejoin="round" stroke-miterlimit="10" x1="96.185" y1="106.762" x2="96.185" y2="106.762"/>
			
				<line fill="none" stroke="#F7B01E" stroke-width="2" stroke-linecap="round" stroke-linejoin="round" stroke-miterlimit="10" x1="96.185" y1="106.762" x2="96.185" y2="106.762"/>
			
				<line fill="none" stroke="#F7B01E" stroke-width="2" stroke-linecap="round" stroke-linejoin="round" stroke-miterlimit="10" x1="96.185" y1="106.762" x2="96.185" y2="106.762"/>
			
				<line fill="none" stroke="#F7B01E" stroke-width="2" stroke-linecap="round" stroke-linejoin="round" stroke-miterlimit="10" x1="96.185" y1="106.762" x2="96.185" y2="106.762"/>
			
				<line fill="none" stroke="#F7B01E" stroke-width="2" stroke-linecap="round" stroke-linejoin="round" stroke-miterlimit="10" x1="96.185" y1="106.762" x2="96.185" y2="106.762"/>
			
				<line fill="none" stroke="#F7B01E" stroke-width="2" stroke-linecap="round" stroke-linejoin="round" stroke-miterlimit="10" x1="86.717" y1="97.294" x2="96.185" y2="106.762"/>
			
				<line fill="none" stroke="#F7B01E" stroke-width="2" stroke-linecap="round" stroke-linejoin="round" stroke-miterlimit="10" x1="96.185" y1="106.762" x2="96.185" y2="106.762"/>
			<path fill="none" stroke="#F7B01E" stroke-width="2" stroke-linecap="round" stroke-linejoin="round" stroke-miterlimit="10" d="
				M96.185,106.762"/>
			
				<line fill="none" stroke="#F7B01E" stroke-width="2" stroke-linecap="round" stroke-linejoin="round" stroke-miterlimit="10" x1="96.185" y1="106.762" x2="96.185" y2="106.762"/>
			
				<line fill="none" stroke="#F7B01E" stroke-width="2" stroke-linecap="round" stroke-linejoin="round" stroke-miterlimit="10" x1="96.185" y1="106.762" x2="96.185" y2="106.762"/>
			
				<line fill="none" stroke="#F7B01E" stroke-width="2" stroke-linecap="round" stroke-linejoin="round" stroke-miterlimit="10" x1="96.185" y1="106.762" x2="96.185" y2="106.762"/>
			
				<line fill="none" stroke="#F7B01E" stroke-width="2" stroke-linecap="round" stroke-linejoin="round" stroke-miterlimit="10" x1="96.185" y1="106.762" x2="96.185" y2="106.762"/>
			
				<line fill="none" stroke="#F7B01E" stroke-width="2" stroke-linecap="round" stroke-linejoin="round" stroke-miterlimit="10" x1="96.185" y1="106.762" x2="96.185" y2="106.762"/>
			
				<line fill="none" stroke="#F7B01E" stroke-width="2" stroke-linecap="round" stroke-linejoin="round" stroke-miterlimit="10" x1="96.185" y1="106.762" x2="96.185" y2="106.762"/>
			<path fill="none" stroke="#F7B01E" stroke-width="2" stroke-linecap="round" stroke-linejoin="round" stroke-miterlimit="10" d="
				M96.185,106.762"/>
			
				<line fill="none" stroke="#F7B01E" stroke-width="2" stroke-linecap="round" stroke-linejoin="round" stroke-miterlimit="10" x1="96.185" y1="106.762" x2="96.185" y2="106.762"/>
			
				<line fill="none" stroke="#F7B01E" stroke-width="2" stroke-linecap="round" stroke-linejoin="round" stroke-miterlimit="10" x1="83.604" y1="103.391" x2="96.185" y2="106.762"/>
			
				<line fill="none" stroke="#F7B01E" stroke-width="2" stroke-linecap="round" stroke-linejoin="round" stroke-miterlimit="10" x1="96.185" y1="106.762" x2="96.185" y2="106.762"/>
			
				<line fill="none" stroke="#F7B01E" stroke-width="2" stroke-linecap="round" stroke-linejoin="round" stroke-miterlimit="10" x1="96.185" y1="106.762" x2="96.185" y2="106.762"/>
			<path fill="none" stroke="#F7B01E" stroke-width="2" stroke-linecap="round" stroke-linejoin="round" stroke-miterlimit="10" d="
				M96.185,106.763"/>
			
				<line fill="none" stroke="#F7B01E" stroke-width="2" stroke-linecap="round" stroke-linejoin="round" stroke-miterlimit="10" x1="96.185" y1="106.762" x2="96.185" y2="106.762"/>
			
				<line fill="none" stroke="#F7B01E" stroke-width="2" stroke-linecap="round" stroke-linejoin="round" stroke-miterlimit="10" x1="92.683" y1="93.692" x2="96.185" y2="106.762"/>
			
				<line fill="none" stroke="#F7B01E" stroke-width="2" stroke-linecap="round" stroke-linejoin="round" stroke-miterlimit="10" x1="96.185" y1="106.762" x2="96.185" y2="106.762"/>
			
				<line fill="none" stroke="#F7B01E" stroke-width="2" stroke-linecap="round" stroke-linejoin="round" stroke-miterlimit="10" x1="96.185" y1="106.763" x2="96.185" y2="106.762"/>
			
				<line fill="none" stroke="#F7B01E" stroke-width="2" stroke-linecap="round" stroke-linejoin="round" stroke-miterlimit="10" x1="96.185" y1="106.762" x2="96.185" y2="106.762"/>
			
				<line fill="none" stroke="#F7B01E" stroke-width="2" stroke-linecap="round" stroke-linejoin="round" stroke-miterlimit="10" x1="96.185" y1="106.762" x2="96.185" y2="106.762"/>
			
				<line fill="none" stroke="#F7B01E" stroke-width="2" stroke-linecap="round" stroke-linejoin="round" stroke-miterlimit="10" x1="96.185" y1="106.762" x2="96.185" y2="106.762"/>
			
				<line fill="none" stroke="#F7B01E" stroke-width="2" stroke-linecap="round" stroke-linejoin="round" stroke-miterlimit="10" x1="96.185" y1="106.762" x2="96.185" y2="106.762"/>
			
				<line fill="none" stroke="#F7B01E" stroke-width="2" stroke-linecap="round" stroke-linejoin="round" stroke-miterlimit="10" x1="96.185" y1="106.762" x2="96.185" y2="106.762"/>
			
				<line fill="none" stroke="#F7B01E" stroke-width="2" stroke-linecap="round" stroke-linejoin="round" stroke-miterlimit="10" x1="96.185" y1="106.762" x2="96.185" y2="106.762"/>
			
				<line fill="none" stroke="#F7B01E" stroke-width="2" stroke-linecap="round" stroke-linejoin="round" stroke-miterlimit="10" x1="96.185" y1="106.762" x2="96.185" y2="106.762"/>
			
				<line fill="none" stroke="#F7B01E" stroke-width="2" stroke-linecap="round" stroke-linejoin="round" stroke-miterlimit="10" x1="96.185" y1="106.762" x2="96.185" y2="106.762"/>
			
				<line fill="none" stroke="#F7B01E" stroke-width="2" stroke-linecap="round" stroke-linejoin="round" stroke-miterlimit="10" x1="96.185" y1="106.762" x2="96.185" y2="106.762"/>
			<path fill="none" stroke="#F7B01E" stroke-width="2" stroke-linecap="round" stroke-linejoin="round" stroke-miterlimit="10" d="
				M96.185,106.762"/>
			
				<line fill="none" stroke="#F7B01E" stroke-width="2" stroke-linecap="round" stroke-linejoin="round" stroke-miterlimit="10" x1="96.185" y1="106.762" x2="96.185" y2="106.762"/>
			
				<line fill="none" stroke="#F7B01E" stroke-width="2" stroke-linecap="round" stroke-linejoin="round" stroke-miterlimit="10" x1="99.687" y1="93.692" x2="96.185" y2="106.762"/>
			
				<line fill="none" stroke="#F7B01E" stroke-width="2" stroke-linecap="round" stroke-linejoin="round" stroke-miterlimit="10" x1="96.185" y1="106.762" x2="96.185" y2="106.762"/>
			
				<line fill="none" stroke="#F7B01E" stroke-width="2" stroke-linecap="round" stroke-linejoin="round" stroke-miterlimit="10" x1="96.185" y1="106.762" x2="96.185" y2="106.762"/>
			
				<line fill="none" stroke="#F7B01E" stroke-width="2" stroke-linecap="round" stroke-linejoin="round" stroke-miterlimit="10" x1="96.185" y1="106.762" x2="96.185" y2="106.762"/>
			
				<line fill="none" stroke="#F7B01E" stroke-width="2" stroke-linecap="round" stroke-linejoin="round" stroke-miterlimit="10" x1="96.185" y1="106.762" x2="96.185" y2="106.762"/>
			
				<line fill="none" stroke="#F7B01E" stroke-width="2" stroke-linecap="round" stroke-linejoin="round" stroke-miterlimit="10" x1="96.185" y1="106.762" x2="96.185" y2="106.762"/>
			
				<line fill="none" stroke="#F7B01E" stroke-width="2" stroke-linecap="round" stroke-linejoin="round" stroke-miterlimit="10" x1="96.185" y1="106.762" x2="96.185" y2="106.762"/>
			
				<line fill="none" stroke="#F7B01E" stroke-width="2" stroke-linecap="round" stroke-linejoin="round" stroke-miterlimit="10" x1="96.185" y1="106.762" x2="96.185" y2="106.762"/>
			
				<line fill="none" stroke="#F7B01E" stroke-width="2" stroke-linecap="round" stroke-linejoin="round" stroke-miterlimit="10" x1="96.185" y1="106.762" x2="96.185" y2="106.762"/>
			
				<line fill="none" stroke="#F7B01E" stroke-width="2" stroke-linecap="round" stroke-linejoin="round" stroke-miterlimit="10" x1="96.185" y1="106.762" x2="96.185" y2="106.762"/>
			
				<line fill="none" stroke="#F7B01E" stroke-width="2" stroke-linecap="round" stroke-linejoin="round" stroke-miterlimit="10" x1="96.185" y1="106.762" x2="96.185" y2="106.762"/>
			
				<line fill="none" stroke="#F7B01E" stroke-width="2" stroke-linecap="round" stroke-linejoin="round" stroke-miterlimit="10" x1="96.185" y1="106.762" x2="96.185" y2="106.762"/>
			
				<line fill="none" stroke="#F7B01E" stroke-width="2" stroke-linecap="round" stroke-linejoin="round" stroke-miterlimit="10" x1="96.185" y1="106.762" x2="96.185" y2="106.762"/>
			
				<line fill="none" stroke="#F7B01E" stroke-width="2" stroke-linecap="round" stroke-linejoin="round" stroke-miterlimit="10" x1="96.185" y1="106.762" x2="96.185" y2="106.762"/>
			
				<line fill="none" stroke="#F7B01E" stroke-width="2" stroke-linecap="round" stroke-linejoin="round" stroke-miterlimit="10" x1="96.185" y1="106.762" x2="96.185" y2="106.762"/>
			
				<line fill="none" stroke="#F7B01E" stroke-width="2" stroke-linecap="round" stroke-linejoin="round" stroke-miterlimit="10" x1="96.185" y1="106.762" x2="96.185" y2="106.762"/>
			
				<line fill="none" stroke="#F7B01E" stroke-width="2" stroke-linecap="round" stroke-linejoin="round" stroke-miterlimit="10" x1="105.733" y1="97.214" x2="96.185" y2="106.762"/>
			<path fill="none" stroke="#F7B01E" stroke-width="2" stroke-linecap="round" stroke-linejoin="round" stroke-miterlimit="10" d="
				M96.185,106.762"/>
			
				<line fill="none" stroke="#F7B01E" stroke-width="2" stroke-linecap="round" stroke-linejoin="round" stroke-miterlimit="10" x1="96.185" y1="106.762" x2="96.185" y2="106.762"/>
			
				<line fill="none" stroke="#F7B01E" stroke-width="2" stroke-linecap="round" stroke-linejoin="round" stroke-miterlimit="10" x1="96.185" y1="106.762" x2="96.185" y2="106.762"/>
			
				<line fill="none" stroke="#F7B01E" stroke-width="2" stroke-linecap="round" stroke-linejoin="round" stroke-miterlimit="10" x1="96.185" y1="106.762" x2="96.185" y2="106.762"/>
			<path fill="none" stroke="#F7B01E" stroke-width="2" stroke-linecap="round" stroke-linejoin="round" stroke-miterlimit="10" d="
				M96.185,106.762"/>
			
				<line fill="none" stroke="#F7B01E" stroke-width="2" stroke-linecap="round" stroke-linejoin="round" stroke-miterlimit="10" x1="96.185" y1="106.762" x2="96.185" y2="106.762"/>
			
				<line fill="none" stroke="#F7B01E" stroke-width="2" stroke-linecap="round" stroke-linejoin="round" stroke-miterlimit="10" x1="96.185" y1="106.762" x2="96.185" y2="106.762"/>
			
				<line fill="none" stroke="#F7B01E" stroke-width="2" stroke-linecap="round" stroke-linejoin="round" stroke-miterlimit="10" x1="96.185" y1="106.762" x2="96.185" y2="106.762"/>
			
				<line fill="none" stroke="#F7B01E" stroke-width="2" stroke-linecap="round" stroke-linejoin="round" stroke-miterlimit="10" x1="96.185" y1="106.762" x2="96.185" y2="106.762"/>
			
				<line fill="none" stroke="#F7B01E" stroke-width="2" stroke-linecap="round" stroke-linejoin="round" stroke-miterlimit="10" x1="96.185" y1="106.762" x2="96.185" y2="106.762"/>
			
				<line fill="none" stroke="#F7B01E" stroke-width="2" stroke-linecap="round" stroke-linejoin="round" stroke-miterlimit="10" x1="109.229" y1="103.267" x2="96.185" y2="106.762"/>
			
				<line fill="none" stroke="#F7B01E" stroke-width="2" stroke-linecap="round" stroke-linejoin="round" stroke-miterlimit="10" x1="96.185" y1="106.762" x2="96.185" y2="106.762"/>
			
				<line fill="none" stroke="#F7B01E" stroke-width="2" stroke-linecap="round" stroke-linejoin="round" stroke-miterlimit="10" x1="96.185" y1="106.762" x2="96.185" y2="106.762"/>
		</g>
		<path fill="none" stroke="#3C4852" stroke-width="2" stroke-linecap="round" stroke-linejoin="round" stroke-miterlimit="10" d="
			M122.181,13.265v16.612c0,2.906-0.566,5.388-3.475,5.388H75.561c-2.907,0-6.38-2.481-6.38-5.388V13.265"/>
		
			<polygon fill="none" stroke="#3C4852" stroke-width="2" stroke-linecap="round" stroke-linejoin="round" stroke-miterlimit="10" points="
			99.267,54.265 110.203,35.265 82.862,35.265 93.8,54.265 		"/>
	</g>
	
		<rect x="6.181" y="5.265" display="inline" fill="none" stroke="#3C4852" stroke-width="2" stroke-linecap="round" stroke-linejoin="round" stroke-miterlimit="10" width="158" height="8"/>
	
		<rect x="8.181" y="156.265" display="inline" fill="none" stroke="#3C4852" stroke-width="2" stroke-linecap="round" stroke-linejoin="round" stroke-miterlimit="10" width="158" height="8"/>
	<g display="inline">
		<path fill="none" stroke="#33BEE2" stroke-width="2" stroke-miterlimit="10" d="M69.625,108.149v21.826c0,1.65-1.351,3-3,3H47.798
			c-1.65,0-3,1.35-3,3v13.311c0,1.65,1.35,3,3,3h18.827c1.649,0,4.351,0,6,0h42.735c1.65,0,3-1.35,3-3v-13.311c0-1.65,0-4.35,0-6
			v-21.826H69.625z M95.302,140.711c-5.795,0-10.493-4.698-10.493-10.493s4.698-10.494,10.493-10.494
			c5.796,0,10.494,4.699,10.494,10.494S101.098,140.711,95.302,140.711z"/>
	</g>
</g>
<g id="Layer_2" display="none">
	
		<rect x="7.181" y="145.265" display="inline" fill="none" stroke="#3C4852" stroke-width="2" stroke-linecap="round" stroke-linejoin="round" stroke-miterlimit="10" width="158" height="8"/>
	<g display="inline">
		<path fill="none" stroke="#33BEE2" stroke-width="2" stroke-miterlimit="10" d="M67.789,97.149v21.826c0,1.65-1.351,3-3,3H45.962
			c-1.65,0-3,1.35-3,3v13.311c0,1.65,1.35,3,3,3h18.827c1.649,0,4.351,0,6,0h42.735c1.65,0,3-1.35,3-3v-13.311c0-1.65,0-4.35,0-6
			V97.149H67.789z M93.466,129.711c-5.795,0-10.493-4.698-10.493-10.493s4.698-10.494,10.493-10.494
			c5.796,0,10.494,4.699,10.494,10.494S99.262,129.711,93.466,129.711z"/>
	</g>
	
		<circle display="inline" fill="none" stroke="#3C4852" stroke-width="2" stroke-miterlimit="10" cx="150.439" cy="137.163" r="3.368"/>
	
		<circle display="inline" fill="none" stroke="#3C4852" stroke-width="2" stroke-miterlimit="10" cx="137.811" cy="137.163" r="3.368"/>
	
		<circle display="inline" fill="none" stroke="#3C4852" stroke-width="2" stroke-miterlimit="10" cx="125.183" cy="137.163" r="3.367"/>
	
		<circle display="inline" fill="none" stroke="#3C4852" stroke-width="2" stroke-miterlimit="10" cx="32.43" cy="137.163" r="3.368"/>
	
		<circle display="inline" fill="none" stroke="#3C4852" stroke-width="2" stroke-miterlimit="10" cx="19.802" cy="137.163" r="3.368"/>
	
		<circle display="inline" fill="none" stroke="#3C4852" stroke-width="2" stroke-miterlimit="10" cx="150.439" cy="124.534" r="3.368"/>
	
		<circle display="inline" fill="none" stroke="#3C4852" stroke-width="2" stroke-miterlimit="10" cx="137.811" cy="124.534" r="3.368"/>
	
		<circle display="inline" fill="none" stroke="#3C4852" stroke-width="2" stroke-miterlimit="10" cx="125.183" cy="124.534" r="3.367"/>
	
		<circle display="inline" fill="none" stroke="#3C4852" stroke-width="2" stroke-miterlimit="10" cx="32.43" cy="124.534" r="3.368"/>
	
		<circle display="inline" fill="none" stroke="#3C4852" stroke-width="2" stroke-miterlimit="10" cx="19.802" cy="124.534" r="3.368"/>
	
		<circle display="inline" fill="none" stroke="#3C4852" stroke-width="2" stroke-miterlimit="10" cx="150.439" cy="111.906" r="3.368"/>
	
		<circle display="inline" fill="none" stroke="#3C4852" stroke-width="2" stroke-miterlimit="10" cx="137.811" cy="111.906" r="3.368"/>
	
		<circle display="inline" fill="none" stroke="#3C4852" stroke-width="2" stroke-miterlimit="10" cx="125.183" cy="111.906" r="3.367"/>
	
		<circle display="inline" fill="none" stroke="#3C4852" stroke-width="2" stroke-miterlimit="10" cx="57.688" cy="111.906" r="3.368"/>
	
		<circle display="inline" fill="none" stroke="#3C4852" stroke-width="2" stroke-miterlimit="10" cx="45.059" cy="111.906" r="3.368"/>
	
		<circle display="inline" fill="none" stroke="#3C4852" stroke-width="2" stroke-miterlimit="10" cx="32.43" cy="111.906" r="3.368"/>
	
		<circle display="inline" fill="none" stroke="#3C4852" stroke-width="2" stroke-miterlimit="10" cx="19.802" cy="111.906" r="3.368"/>
	
		<circle display="inline" fill="none" stroke="#3C4852" stroke-width="2" stroke-miterlimit="10" cx="150.439" cy="99.278" r="3.368"/>
	
		<circle display="inline" fill="none" stroke="#3C4852" stroke-width="2" stroke-miterlimit="10" cx="137.811" cy="99.278" r="3.368"/>
	
		<circle display="inline" fill="none" stroke="#3C4852" stroke-width="2" stroke-miterlimit="10" cx="125.183" cy="99.278" r="3.367"/>
	
		<circle display="inline" fill="none" stroke="#3C4852" stroke-width="2" stroke-miterlimit="10" cx="57.688" cy="99.278" r="3.368"/>
	
		<circle display="inline" fill="none" stroke="#3C4852" stroke-width="2" stroke-miterlimit="10" cx="45.059" cy="99.278" r="3.368"/>
	
		<circle display="inline" fill="none" stroke="#3C4852" stroke-width="2" stroke-miterlimit="10" cx="32.43" cy="99.278" r="3.368"/>
	
		<circle display="inline" fill="none" stroke="#3C4852" stroke-width="2" stroke-miterlimit="10" cx="19.802" cy="99.278" r="3.368"/>
	
		<path display="inline" fill="none" stroke="#3C4852" stroke-width="2" stroke-linecap="round" stroke-linejoin="round" stroke-miterlimit="10" d="
		M127.181,23.265v16.612c0,2.906-1.066,5.388-3.975,5.388H60.061c-2.907,0-5.88-2.481-5.88-5.388V23.265"/>
	
		<polygon display="inline" fill="none" stroke="#3C4852" stroke-width="2" stroke-linecap="round" stroke-linejoin="round" stroke-miterlimit="10" points="
		79.767,64.265 90.703,45.265 63.362,45.265 74.3,64.265 	"/>
	
		<polygon display="inline" fill="none" stroke="#3C4852" stroke-width="2" stroke-linecap="round" stroke-linejoin="round" stroke-miterlimit="10" points="
		106.767,64.265 117.703,45.265 90.362,45.265 101.3,64.265 	"/>
	
		<rect x="7.181" y="15.265" display="inline" fill="none" stroke="#3C4852" stroke-width="2" stroke-linecap="round" stroke-linejoin="round" stroke-miterlimit="10" width="158" height="8"/>
	
		<path display="inline" fill="none" stroke="#33BEE2" stroke-width="2" stroke-linecap="round" stroke-linejoin="round" stroke-miterlimit="10" d="
		M111.181,81.432c0-3.773-6.833-14.084-6.833-14.084s-6.833,10.311-6.833,14.084s3.06,6.833,6.833,6.833
		S111.181,85.205,111.181,81.432z"/>
	
		<path display="inline" fill="none" stroke="#33BEE2" stroke-width="2" stroke-linecap="round" stroke-linejoin="round" stroke-miterlimit="10" d="
		M84.181,81.432c0-3.773-6.833-14.084-6.833-14.084s-6.833,10.311-6.833,14.084s3.06,6.833,6.833,6.833S84.181,85.205,84.181,81.432
		z"/>
</g>
<g id="Layer_3">
	
		<rect x="7.181" y="156.265" fill="none" stroke="#3C4852" stroke-width="2" stroke-linecap="round" stroke-linejoin="round" stroke-miterlimit="10" width="158" height="8"/>
	<circle fill="none" stroke="#3C4852" stroke-width="2" stroke-miterlimit="10" cx="139.63" cy="147.898" r="3.368"/>
	<circle fill="none" stroke="#3C4852" stroke-width="2" stroke-miterlimit="10" cx="127.002" cy="147.898" r="3.367"/>
	<circle fill="none" stroke="#3C4852" stroke-width="2" stroke-miterlimit="10" cx="34.25" cy="147.898" r="3.368"/>
	<circle fill="none" stroke="#3C4852" stroke-width="2" stroke-miterlimit="10" cx="21.622" cy="147.898" r="3.368"/>
	<circle fill="none" stroke="#3C4852" stroke-width="2" stroke-miterlimit="10" cx="139.63" cy="135.27" r="3.368"/>
	<circle fill="none" stroke="#3C4852" stroke-width="2" stroke-miterlimit="10" cx="127.002" cy="135.27" r="3.367"/>
	<circle fill="none" stroke="#3C4852" stroke-width="2" stroke-miterlimit="10" cx="34.25" cy="135.27" r="3.368"/>
	<circle fill="none" stroke="#3C4852" stroke-width="2" stroke-miterlimit="10" cx="21.622" cy="135.27" r="3.368"/>
	<circle fill="none" stroke="#3C4852" stroke-width="2" stroke-miterlimit="10" cx="139.63" cy="122.642" r="3.368"/>
	<circle fill="none" stroke="#3C4852" stroke-width="2" stroke-miterlimit="10" cx="127.002" cy="122.642" r="3.367"/>
	<circle fill="none" stroke="#3C4852" stroke-width="2" stroke-miterlimit="10" cx="59.507" cy="122.642" r="3.368"/>
	<circle fill="none" stroke="#3C4852" stroke-width="2" stroke-miterlimit="10" cx="46.878" cy="122.642" r="3.368"/>
	<circle fill="none" stroke="#3C4852" stroke-width="2" stroke-miterlimit="10" cx="34.25" cy="122.642" r="3.368"/>
	<circle fill="none" stroke="#3C4852" stroke-width="2" stroke-miterlimit="10" cx="21.622" cy="122.642" r="3.368"/>
	<circle fill="none" stroke="#3C4852" stroke-width="2" stroke-miterlimit="10" cx="139.63" cy="110.014" r="3.368"/>
	<circle fill="none" stroke="#3C4852" stroke-width="2" stroke-miterlimit="10" cx="151.63" cy="147.898" r="3.368"/>
	<circle fill="none" stroke="#3C4852" stroke-width="2" stroke-miterlimit="10" cx="151.63" cy="135.27" r="3.368"/>
	<circle fill="none" stroke="#3C4852" stroke-width="2" stroke-miterlimit="10" cx="151.63" cy="122.642" r="3.368"/>
	<circle fill="none" stroke="#3C4852" stroke-width="2" stroke-miterlimit="10" cx="151.63" cy="110.014" r="3.368"/>
	<circle fill="none" stroke="#3C4852" stroke-width="2" stroke-miterlimit="10" cx="127.002" cy="110.014" r="3.367"/>
	<circle fill="none" stroke="#3C4852" stroke-width="2" stroke-miterlimit="10" cx="59.507" cy="110.014" r="3.368"/>
	<circle fill="none" stroke="#3C4852" stroke-width="2" stroke-miterlimit="10" cx="46.878" cy="110.014" r="3.368"/>
	<circle fill="none" stroke="#3C4852" stroke-width="2" stroke-miterlimit="10" cx="34.25" cy="110.014" r="3.368"/>
	<circle fill="none" stroke="#3C4852" stroke-width="2" stroke-miterlimit="10" cx="21.622" cy="110.014" r="3.368"/>
	<g>
		<g>
			<line fill="none" x1="87.504" y1="106.497" x2="87.504" y2="106.497"/>
		</g>
		<g>
			<line fill="none" x1="87.504" y1="106.497" x2="87.504" y2="106.497"/>
		</g>
		<g>
			<line fill="none" x1="87.504" y1="106.497" x2="87.504" y2="106.497"/>
		</g>
		<g>
			<g>
				
					<line fill="none" stroke="#F7B01E" stroke-width="2" stroke-linecap="round" stroke-linejoin="round" x1="87.504" y1="61" x2="87.504" y2="64"/>
				
					<line fill="none" stroke="#F7B01E" stroke-width="2" stroke-linecap="round" stroke-linejoin="round" stroke-dasharray="5.6424,5.6424" x1="87.504" y1="69.643" x2="87.504" y2="100.676"/>
				
					<line fill="none" stroke="#F7B01E" stroke-width="2" stroke-linecap="round" stroke-linejoin="round" x1="87.504" y1="103.497" x2="87.504" y2="106.497"/>
			</g>
		</g>
		<g>
			<line fill="none" x1="87.504" y1="106.497" x2="87.504" y2="106.497"/>
		</g>
		<g>
			<line fill="none" x1="87.504" y1="106.497" x2="87.504" y2="106.497"/>
		</g>
		<g>
			<line fill="none" x1="87.504" y1="106.497" x2="87.504" y2="106.497"/>
		</g>
		<g>
			<line fill="none" x1="87.504" y1="106.497" x2="87.504" y2="106.497"/>
		</g>
		<g>
			<path fill="none" d="M87.504,106.497"/>
		</g>
		<g>
			<line fill="none" x1="87.504" y1="106.497" x2="87.504" y2="106.497"/>
		</g>
		<g>
			<line fill="none" x1="87.504" y1="106.497" x2="87.504" y2="106.497"/>
		</g>
		<g>
			<line fill="none" x1="87.504" y1="106.497" x2="87.504" y2="106.497"/>
		</g>
		<g>
			<line fill="none" x1="87.504" y1="106.497" x2="87.504" y2="106.497"/>
		</g>
		<g>
			<line fill="none" x1="87.504" y1="106.497" x2="87.504" y2="106.497"/>
		</g>
		<g>
			<line fill="none" x1="87.504" y1="106.497" x2="87.504" y2="106.497"/>
		</g>
		<g>
			<path fill="none" d="M87.504,106.497"/>
		</g>
		<g>
			<line fill="none" x1="87.504" y1="106.497" x2="87.504" y2="106.497"/>
		</g>
		<g>
			<line fill="none" x1="87.504" y1="106.497" x2="87.504" y2="106.497"/>
		</g>
		<g>
			<line fill="none" x1="87.504" y1="106.497" x2="87.504" y2="106.497"/>
		</g>
		<g>
			<line fill="none" x1="87.504" y1="106.497" x2="87.504" y2="106.497"/>
		</g>
		<g>
			<line fill="none" x1="87.504" y1="106.497" x2="87.504" y2="106.497"/>
		</g>
		<g>
			<line fill="none" x1="87.504" y1="106.497" x2="87.504" y2="106.497"/>
		</g>
		<g>
			<line fill="none" x1="87.504" y1="106.497" x2="87.504" y2="106.497"/>
		</g>
		<g>
			<line fill="none" x1="87.504" y1="106.497" x2="87.504" y2="106.497"/>
		</g>
		<g>
			<path fill="none" d="M87.504,106.497"/>
		</g>
		<g>
			<line fill="none" x1="87.504" y1="106.497" x2="87.504" y2="106.497"/>
		</g>
		<g>
			<line fill="none" x1="87.504" y1="106.497" x2="87.504" y2="106.497"/>
		</g>
		<g>
			<line fill="none" x1="87.504" y1="106.497" x2="87.504" y2="106.497"/>
		</g>
		<g>
			<line fill="none" x1="87.504" y1="106.497" x2="87.504" y2="106.497"/>
		</g>
		<g>
			<line fill="none" x1="87.504" y1="106.497" x2="87.504" y2="106.497"/>
		</g>
		<g>
			<line fill="none" x1="87.504" y1="106.497" x2="87.504" y2="106.497"/>
		</g>
		<g>
			<line fill="none" x1="87.504" y1="106.497" x2="87.504" y2="106.497"/>
		</g>
		<g>
			<line fill="none" x1="87.504" y1="106.497" x2="87.504" y2="106.497"/>
		</g>
		<g>
			<line fill="none" x1="87.504" y1="106.497" x2="87.504" y2="106.497"/>
		</g>
		<g>
			<line fill="none" x1="87.504" y1="106.497" x2="87.504" y2="106.497"/>
		</g>
		<g>
			<line fill="none" x1="87.504" y1="106.497" x2="87.504" y2="106.497"/>
		</g>
		<g>
			<line fill="none" x1="87.504" y1="106.497" x2="87.504" y2="106.497"/>
		</g>
		<g>
			<line fill="none" x1="87.504" y1="106.497" x2="87.504" y2="106.497"/>
		</g>
		<g>
			<line fill="none" x1="87.504" y1="106.497" x2="87.504" y2="106.497"/>
		</g>
		<g>
			<line fill="none" x1="87.504" y1="106.497" x2="87.504" y2="106.497"/>
		</g>
		<g>
			<line fill="none" x1="87.504" y1="106.497" x2="87.504" y2="106.497"/>
		</g>
		<g>
			<path fill="none" d="M87.504,106.498"/>
		</g>
		<g>
			<line fill="none" x1="87.504" y1="106.497" x2="87.504" y2="106.498"/>
		</g>
		<g>
			<line fill="none" x1="87.504" y1="106.497" x2="87.504" y2="106.497"/>
		</g>
		<g>
			<line fill="none" x1="87.504" y1="106.497" x2="87.504" y2="106.497"/>
		</g>
		<g>
			<line fill="none" x1="87.504" y1="106.497" x2="87.504" y2="106.497"/>
		</g>
		<g>
			<line fill="none" x1="87.504" y1="106.497" x2="87.504" y2="106.497"/>
		</g>
		<g>
			<line fill="none" x1="87.504" y1="106.497" x2="87.504" y2="106.497"/>
		</g>
		<g>
			<path fill="none" d="M87.504,106.497"/>
		</g>
		<g>
			<line fill="none" x1="87.504" y1="106.497" x2="87.504" y2="106.497"/>
		</g>
		<g>
			<line fill="none" x1="87.504" y1="106.497" x2="87.504" y2="106.497"/>
		</g>
		<g>
			<line fill="none" x1="87.504" y1="106.497" x2="87.504" y2="106.497"/>
		</g>
		<g>
			<line fill="none" x1="87.504" y1="106.497" x2="87.504" y2="106.497"/>
		</g>
		<g>
			<line fill="none" x1="87.504" y1="106.497" x2="87.504" y2="106.497"/>
		</g>
		<g>
			<line fill="none" x1="87.504" y1="106.497" x2="87.504" y2="106.497"/>
		</g>
		<g>
			<line fill="none" x1="87.504" y1="106.497" x2="87.504" y2="106.497"/>
		</g>
		<g>
			<line fill="none" x1="87.504" y1="106.497" x2="87.504" y2="106.497"/>
		</g>
		<g>
			<line fill="none" x1="87.504" y1="106.497" x2="87.504" y2="106.497"/>
		</g>
		<g>
			<line fill="none" x1="87.504" y1="106.497" x2="87.504" y2="106.497"/>
		</g>
		<g>
			<line fill="none" x1="87.504" y1="106.497" x2="87.504" y2="106.497"/>
		</g>
		<g>
			<path fill="none" d="M87.504,106.497"/>
		</g>
		<g>
			<line fill="none" x1="87.504" y1="106.497" x2="87.504" y2="106.497"/>
		</g>
		<g>
			<line fill="none" x1="87.504" y1="106.497" x2="87.504" y2="106.497"/>
		</g>
		<g>
			<line fill="none" x1="87.504" y1="106.497" x2="87.504" y2="106.497"/>
		</g>
		<g>
			<line fill="none" x1="87.504" y1="106.497" x2="87.504" y2="106.497"/>
		</g>
		<g>
			<line fill="none" x1="87.504" y1="106.497" x2="87.504" y2="106.497"/>
		</g>
		<g>
			<line fill="none" x1="87.504" y1="106.497" x2="87.504" y2="106.497"/>
		</g>
		<g>
			<path fill="none" d="M87.504,106.497"/>
		</g>
		<g>
			<line fill="none" x1="87.504" y1="106.497" x2="87.504" y2="106.497"/>
		</g>
		<g>
			<line fill="none" x1="87.504" y1="106.497" x2="87.504" y2="106.497"/>
		</g>
		<g>
			<line fill="none" x1="87.504" y1="106.497" x2="87.504" y2="106.497"/>
		</g>
		<g>
			<path fill="none" d="M87.504,106.498"/>
		</g>
		<g>
			<line fill="none" x1="87.504" y1="106.497" x2="87.504" y2="106.497"/>
		</g>
		<g>
			<line fill="none" x1="87.504" y1="106.497" x2="87.504" y2="106.497"/>
		</g>
		<g>
			<line fill="none" x1="87.504" y1="106.498" x2="87.504" y2="106.497"/>
		</g>
		<g>
			<line fill="none" x1="87.504" y1="106.497" x2="87.504" y2="106.497"/>
		</g>
		<g>
			<line fill="none" x1="87.504" y1="106.497" x2="87.504" y2="106.497"/>
		</g>
		<g>
			<line fill="none" x1="87.504" y1="106.497" x2="87.504" y2="106.497"/>
		</g>
		<g>
			<line fill="none" x1="87.504" y1="106.497" x2="87.504" y2="106.497"/>
		</g>
		<g>
			<line fill="none" x1="87.504" y1="106.497" x2="87.504" y2="106.497"/>
		</g>
		<g>
			<line fill="none" x1="87.504" y1="106.497" x2="87.504" y2="106.497"/>
		</g>
		<g>
			<line fill="none" x1="87.504" y1="106.497" x2="87.504" y2="106.497"/>
		</g>
		<g>
			<line fill="none" x1="87.504" y1="106.497" x2="87.504" y2="106.497"/>
		</g>
		<g>
			<line fill="none" x1="87.504" y1="106.497" x2="87.504" y2="106.497"/>
		</g>
		<g>
			<path fill="none" d="M87.504,106.497"/>
		</g>
		<g>
			<line fill="none" x1="87.504" y1="106.497" x2="87.504" y2="106.497"/>
		</g>
		<g>
			<line fill="none" x1="87.504" y1="106.497" x2="87.504" y2="106.497"/>
		</g>
		<g>
			<line fill="none" x1="87.504" y1="106.497" x2="87.504" y2="106.497"/>
		</g>
		<g>
			<line fill="none" x1="87.504" y1="106.497" x2="87.504" y2="106.497"/>
		</g>
		<g>
			<line fill="none" x1="87.504" y1="106.497" x2="87.504" y2="106.497"/>
		</g>
		<g>
			<line fill="none" x1="87.504" y1="106.497" x2="87.504" y2="106.497"/>
		</g>
		<g>
			<line fill="none" x1="87.504" y1="106.497" x2="87.504" y2="106.497"/>
		</g>
		<g>
			<line fill="none" x1="87.504" y1="106.497" x2="87.504" y2="106.497"/>
		</g>
		<g>
			<line fill="none" x1="87.504" y1="106.497" x2="87.504" y2="106.497"/>
		</g>
		<g>
			<line fill="none" x1="87.504" y1="106.497" x2="87.504" y2="106.497"/>
		</g>
		<g>
			<line fill="none" x1="87.504" y1="106.497" x2="87.504" y2="106.497"/>
		</g>
		<g>
			<line fill="none" x1="87.504" y1="106.497" x2="87.504" y2="106.497"/>
		</g>
		<g>
			<line fill="none" x1="87.504" y1="106.497" x2="87.504" y2="106.497"/>
		</g>
		<g>
			<line fill="none" x1="87.504" y1="106.497" x2="87.504" y2="106.497"/>
		</g>
		<g>
			<line fill="none" x1="87.504" y1="106.497" x2="87.504" y2="106.497"/>
		</g>
		<g>
			<line fill="none" x1="87.504" y1="106.497" x2="87.504" y2="106.497"/>
		</g>
		<g>
			<path fill="none" d="M87.504,106.497"/>
		</g>
		<g>
			<line fill="none" x1="87.504" y1="106.497" x2="87.504" y2="106.497"/>
		</g>
		<g>
			<line fill="none" x1="87.504" y1="106.497" x2="87.504" y2="106.497"/>
		</g>
		<g>
			<line fill="none" x1="87.504" y1="106.497" x2="87.504" y2="106.497"/>
		</g>
		<g>
			<path fill="none" d="M87.504,106.497"/>
		</g>
		<g>
			<line fill="none" x1="87.504" y1="106.497" x2="87.504" y2="106.497"/>
		</g>
		<g>
			<line fill="none" x1="87.504" y1="106.497" x2="87.504" y2="106.497"/>
		</g>
		<g>
			<line fill="none" x1="87.504" y1="106.497" x2="87.504" y2="106.497"/>
		</g>
		<g>
			<line fill="none" x1="87.504" y1="106.497" x2="87.504" y2="106.497"/>
		</g>
		<g>
			<line fill="none" x1="87.504" y1="106.497" x2="87.504" y2="106.497"/>
		</g>
		<g>
			<line fill="none" x1="87.504" y1="106.497" x2="87.504" y2="106.497"/>
		</g>
		<g>
			<line fill="none" x1="87.504" y1="106.497" x2="87.504" y2="106.497"/>
		</g>
	</g>
	<g>
		<path fill="none" stroke="#33BEE2" stroke-width="2" stroke-miterlimit="10" d="M68.911,107.885v21.826c0,1.65-1.351,3-3,3H47.084
			c-1.65,0-3,1.35-3,3v13.311c0,1.65,1.35,3,3,3h18.827c1.649,0,4.351,0,6,0h42.735c1.65,0,3-1.35,3-3v-13.311c0-1.65,0-4.35,0-6
			v-21.826H68.911z M94.588,140.446c-5.795,0-10.493-4.698-10.493-10.493s4.698-10.494,10.493-10.494
			c5.796,0,10.494,4.699,10.494,10.494S100.384,140.446,94.588,140.446z"/>
	</g>
	<path fill="none" stroke="#3C4852" stroke-width="2" stroke-linecap="round" stroke-linejoin="round" stroke-miterlimit="10" d="
		M115.181,13.265v16.348c0,2.906-1.247,5.652-4.155,5.652H67.88c-2.907,0-5.699-2.746-5.699-5.652V13.265"/>
	
		<rect x="7.181" y="5.265" fill="none" stroke="#3C4852" stroke-width="2" stroke-linecap="round" stroke-linejoin="round" stroke-miterlimit="10" width="158" height="8"/>
	
		<rect x="81.181" y="35.265" fill="none" stroke="#3C4852" stroke-width="2" stroke-linecap="round" stroke-linejoin="round" stroke-miterlimit="10" width="15" height="26"/>
</g>
<g id="Layer_4" display="none">
	<g display="inline">
		
			<line fill="none" stroke="#33BEE2" stroke-width="2" stroke-linecap="round" stroke-linejoin="round" stroke-miterlimit="10" x1="94.084" y1="99.344" x2="94.084" y2="99.344"/>
		
			<line fill="none" stroke="#33BEE2" stroke-width="2" stroke-linecap="round" stroke-linejoin="round" stroke-miterlimit="10" x1="94.084" y1="99.344" x2="94.084" y2="99.344"/>
		
			<line fill="none" stroke="#33BEE2" stroke-width="2" stroke-linecap="round" stroke-linejoin="round" stroke-miterlimit="10" x1="94.084" y1="99.344" x2="94.084" y2="99.344"/>
		
			<line fill="none" stroke="#33BEE2" stroke-width="2" stroke-linecap="round" stroke-linejoin="round" stroke-miterlimit="10" x1="94.084" y1="60" x2="94.084" y2="99.344"/>
		
			<line fill="none" stroke="#33BEE2" stroke-width="2" stroke-linecap="round" stroke-linejoin="round" stroke-miterlimit="10" x1="94.084" y1="99.344" x2="94.084" y2="99.344"/>
		
			<line fill="none" stroke="#33BEE2" stroke-width="2" stroke-linecap="round" stroke-linejoin="round" stroke-miterlimit="10" x1="94.084" y1="99.344" x2="94.084" y2="99.344"/>
		
			<line fill="none" stroke="#33BEE2" stroke-width="2" stroke-linecap="round" stroke-linejoin="round" stroke-miterlimit="10" x1="94.084" y1="99.344" x2="94.084" y2="99.344"/>
		
			<line fill="none" stroke="#33BEE2" stroke-width="2" stroke-linecap="round" stroke-linejoin="round" stroke-miterlimit="10" x1="94.084" y1="99.344" x2="94.084" y2="99.344"/>
		<path fill="none" stroke="#33BEE2" stroke-width="2" stroke-linecap="round" stroke-linejoin="round" stroke-miterlimit="10" d="
			M94.084,99.344"/>
		
			<line fill="none" stroke="#33BEE2" stroke-width="2" stroke-linecap="round" stroke-linejoin="round" stroke-miterlimit="10" x1="94.084" y1="99.344" x2="94.084" y2="99.344"/>
		
			<line fill="none" stroke="#33BEE2" stroke-width="2" stroke-linecap="round" stroke-linejoin="round" stroke-miterlimit="10" x1="94.084" y1="99.344" x2="94.084" y2="99.344"/>
		
			<line fill="none" stroke="#33BEE2" stroke-width="2" stroke-linecap="round" stroke-linejoin="round" stroke-miterlimit="10" x1="94.084" y1="99.344" x2="94.084" y2="99.344"/>
		
			<line fill="none" stroke="#33BEE2" stroke-width="2" stroke-linecap="round" stroke-linejoin="round" stroke-miterlimit="10" x1="94.084" y1="99.344" x2="94.084" y2="99.344"/>
		
			<line fill="none" stroke="#33BEE2" stroke-width="2" stroke-linecap="round" stroke-linejoin="round" stroke-miterlimit="10" x1="94.084" y1="99.344" x2="94.084" y2="99.344"/>
		
			<line fill="none" stroke="#33BEE2" stroke-width="2" stroke-linecap="round" stroke-linejoin="round" stroke-miterlimit="10" x1="94.084" y1="99.344" x2="94.084" y2="99.344"/>
		<path fill="none" stroke="#33BEE2" stroke-width="2" stroke-linecap="round" stroke-linejoin="round" stroke-miterlimit="10" d="
			M94.084,99.344"/>
		
			<line fill="none" stroke="#33BEE2" stroke-width="2" stroke-linecap="round" stroke-linejoin="round" stroke-miterlimit="10" x1="94.084" y1="99.344" x2="94.084" y2="99.344"/>
		
			<line fill="none" stroke="#33BEE2" stroke-width="2" stroke-linecap="round" stroke-linejoin="round" stroke-miterlimit="10" x1="94.084" y1="99.344" x2="94.084" y2="99.344"/>
		
			<line fill="none" stroke="#33BEE2" stroke-width="2" stroke-linecap="round" stroke-linejoin="round" stroke-miterlimit="10" x1="94.084" y1="99.344" x2="94.084" y2="99.344"/>
		
			<line fill="none" stroke="#33BEE2" stroke-width="2" stroke-linecap="round" stroke-linejoin="round" stroke-miterlimit="10" x1="94.084" y1="99.344" x2="94.084" y2="99.344"/>
		
			<line fill="none" stroke="#33BEE2" stroke-width="2" stroke-linecap="round" stroke-linejoin="round" stroke-miterlimit="10" x1="94.084" y1="99.344" x2="94.084" y2="99.344"/>
		
			<line fill="none" stroke="#33BEE2" stroke-width="2" stroke-linecap="round" stroke-linejoin="round" stroke-miterlimit="10" x1="94.084" y1="99.344" x2="94.084" y2="99.344"/>
		
			<line fill="none" stroke="#33BEE2" stroke-width="2" stroke-linecap="round" stroke-linejoin="round" stroke-miterlimit="10" x1="94.084" y1="99.344" x2="94.084" y2="99.344"/>
		
			<line fill="none" stroke="#33BEE2" stroke-width="2" stroke-linecap="round" stroke-linejoin="round" stroke-miterlimit="10" x1="94.084" y1="99.344" x2="94.084" y2="99.344"/>
		<path fill="none" stroke="#33BEE2" stroke-width="2" stroke-linecap="round" stroke-linejoin="round" stroke-miterlimit="10" d="
			M94.084,99.344"/>
		
			<line fill="none" stroke="#33BEE2" stroke-width="2" stroke-linecap="round" stroke-linejoin="round" stroke-miterlimit="10" x1="94.084" y1="99.344" x2="94.084" y2="99.344"/>
		
			<line fill="none" stroke="#33BEE2" stroke-width="2" stroke-linecap="round" stroke-linejoin="round" stroke-miterlimit="10" x1="94.084" y1="99.344" x2="94.084" y2="99.344"/>
		
			<line fill="none" stroke="#33BEE2" stroke-width="2" stroke-linecap="round" stroke-linejoin="round" stroke-miterlimit="10" x1="94.084" y1="99.344" x2="94.084" y2="99.344"/>
		
			<line fill="none" stroke="#33BEE2" stroke-width="2" stroke-linecap="round" stroke-linejoin="round" stroke-miterlimit="10" x1="94.084" y1="99.344" x2="94.084" y2="99.344"/>
		
			<line fill="none" stroke="#33BEE2" stroke-width="2" stroke-linecap="round" stroke-linejoin="round" stroke-miterlimit="10" x1="94.084" y1="99.344" x2="94.084" y2="99.344"/>
		
			<line fill="none" stroke="#33BEE2" stroke-width="2" stroke-linecap="round" stroke-linejoin="round" stroke-miterlimit="10" x1="94.084" y1="99.344" x2="94.084" y2="99.344"/>
		
			<line fill="none" stroke="#33BEE2" stroke-width="2" stroke-linecap="round" stroke-linejoin="round" stroke-miterlimit="10" x1="94.084" y1="99.344" x2="94.084" y2="99.344"/>
		
			<line fill="none" stroke="#33BEE2" stroke-width="2" stroke-linecap="round" stroke-linejoin="round" stroke-miterlimit="10" x1="94.084" y1="99.344" x2="94.084" y2="99.344"/>
		
			<line fill="none" stroke="#33BEE2" stroke-width="2" stroke-linecap="round" stroke-linejoin="round" stroke-miterlimit="10" x1="94.084" y1="99.344" x2="94.084" y2="99.344"/>
		
			<line fill="none" stroke="#33BEE2" stroke-width="2" stroke-linecap="round" stroke-linejoin="round" stroke-miterlimit="10" x1="94.084" y1="99.344" x2="94.084" y2="99.344"/>
		
			<line fill="none" stroke="#33BEE2" stroke-width="2" stroke-linecap="round" stroke-linejoin="round" stroke-miterlimit="10" x1="94.084" y1="99.344" x2="94.084" y2="99.344"/>
		
			<line fill="none" stroke="#33BEE2" stroke-width="2" stroke-linecap="round" stroke-linejoin="round" stroke-miterlimit="10" x1="94.084" y1="99.344" x2="94.084" y2="99.344"/>
		
			<line fill="none" stroke="#33BEE2" stroke-width="2" stroke-linecap="round" stroke-linejoin="round" stroke-miterlimit="10" x1="94.084" y1="99.344" x2="94.084" y2="99.344"/>
		
			<line fill="none" stroke="#33BEE2" stroke-width="2" stroke-linecap="round" stroke-linejoin="round" stroke-miterlimit="10" x1="94.084" y1="99.344" x2="94.084" y2="99.344"/>
		
			<line fill="none" stroke="#33BEE2" stroke-width="2" stroke-linecap="round" stroke-linejoin="round" stroke-miterlimit="10" x1="94.084" y1="99.344" x2="94.084" y2="99.344"/>
		
			<line fill="none" stroke="#33BEE2" stroke-width="2" stroke-linecap="round" stroke-linejoin="round" stroke-miterlimit="10" x1="94.084" y1="99.344" x2="94.084" y2="99.344"/>
		<path fill="none" stroke="#33BEE2" stroke-width="2" stroke-linecap="round" stroke-linejoin="round" stroke-miterlimit="10" d="
			M94.084,99.345"/>
		
			<line fill="none" stroke="#33BEE2" stroke-width="2" stroke-linecap="round" stroke-linejoin="round" stroke-miterlimit="10" x1="94.084" y1="99.344" x2="94.084" y2="99.345"/>
		
			<line fill="none" stroke="#33BEE2" stroke-width="2" stroke-linecap="round" stroke-linejoin="round" stroke-miterlimit="10" x1="94.084" y1="99.344" x2="94.084" y2="99.344"/>
		
			<line fill="none" stroke="#33BEE2" stroke-width="2" stroke-linecap="round" stroke-linejoin="round" stroke-miterlimit="10" x1="94.084" y1="99.344" x2="94.084" y2="99.344"/>
		
			<line fill="none" stroke="#33BEE2" stroke-width="2" stroke-linecap="round" stroke-linejoin="round" stroke-miterlimit="10" x1="94.084" y1="99.344" x2="94.084" y2="99.344"/>
		
			<line fill="none" stroke="#33BEE2" stroke-width="2" stroke-linecap="round" stroke-linejoin="round" stroke-miterlimit="10" x1="94.084" y1="99.344" x2="94.084" y2="99.344"/>
		
			<line fill="none" stroke="#33BEE2" stroke-width="2" stroke-linecap="round" stroke-linejoin="round" stroke-miterlimit="10" x1="94.084" y1="99.344" x2="94.084" y2="99.344"/>
		<path fill="none" stroke="#33BEE2" stroke-width="2" stroke-linecap="round" stroke-linejoin="round" stroke-miterlimit="10" d="
			M94.084,99.344"/>
		
			<line fill="none" stroke="#33BEE2" stroke-width="2" stroke-linecap="round" stroke-linejoin="round" stroke-miterlimit="10" x1="94.084" y1="99.344" x2="94.084" y2="99.344"/>
		
			<line fill="none" stroke="#33BEE2" stroke-width="2" stroke-linecap="round" stroke-linejoin="round" stroke-miterlimit="10" x1="94.084" y1="99.344" x2="94.084" y2="99.344"/>
		
			<line fill="none" stroke="#33BEE2" stroke-width="2" stroke-linecap="round" stroke-linejoin="round" stroke-miterlimit="10" x1="94.084" y1="99.344" x2="94.084" y2="99.344"/>
		
			<line fill="none" stroke="#33BEE2" stroke-width="2" stroke-linecap="round" stroke-linejoin="round" stroke-miterlimit="10" x1="94.084" y1="99.344" x2="94.084" y2="99.344"/>
		
			<line fill="none" stroke="#33BEE2" stroke-width="2" stroke-linecap="round" stroke-linejoin="round" stroke-miterlimit="10" x1="94.084" y1="99.344" x2="94.084" y2="99.344"/>
		
			<line fill="none" stroke="#33BEE2" stroke-width="2" stroke-linecap="round" stroke-linejoin="round" stroke-miterlimit="10" x1="94.084" y1="99.344" x2="94.084" y2="99.344"/>
		
			<line fill="none" stroke="#33BEE2" stroke-width="2" stroke-linecap="round" stroke-linejoin="round" stroke-miterlimit="10" x1="94.084" y1="99.344" x2="94.084" y2="99.344"/>
		
			<line fill="none" stroke="#33BEE2" stroke-width="2" stroke-linecap="round" stroke-linejoin="round" stroke-miterlimit="10" x1="94.084" y1="99.344" x2="94.084" y2="99.344"/>
		
			<line fill="none" stroke="#33BEE2" stroke-width="2" stroke-linecap="round" stroke-linejoin="round" stroke-miterlimit="10" x1="94.084" y1="99.344" x2="94.084" y2="99.344"/>
		
			<line fill="none" stroke="#33BEE2" stroke-width="2" stroke-linecap="round" stroke-linejoin="round" stroke-miterlimit="10" x1="94.084" y1="99.344" x2="94.084" y2="99.344"/>
		
			<line fill="none" stroke="#33BEE2" stroke-width="2" stroke-linecap="round" stroke-linejoin="round" stroke-miterlimit="10" x1="94.084" y1="99.344" x2="94.084" y2="99.344"/>
		<path fill="none" stroke="#33BEE2" stroke-width="2" stroke-linecap="round" stroke-linejoin="round" stroke-miterlimit="10" d="
			M94.084,99.344"/>
		
			<line fill="none" stroke="#33BEE2" stroke-width="2" stroke-linecap="round" stroke-linejoin="round" stroke-miterlimit="10" x1="94.084" y1="99.344" x2="94.084" y2="99.344"/>
		
			<line fill="none" stroke="#33BEE2" stroke-width="2" stroke-linecap="round" stroke-linejoin="round" stroke-miterlimit="10" x1="94.084" y1="99.344" x2="94.084" y2="99.344"/>
		
			<line fill="none" stroke="#33BEE2" stroke-width="2" stroke-linecap="round" stroke-linejoin="round" stroke-miterlimit="10" x1="94.084" y1="99.344" x2="94.084" y2="99.344"/>
		
			<line fill="none" stroke="#33BEE2" stroke-width="2" stroke-linecap="round" stroke-linejoin="round" stroke-miterlimit="10" x1="94.084" y1="99.344" x2="94.084" y2="99.344"/>
		
			<line fill="none" stroke="#33BEE2" stroke-width="2" stroke-linecap="round" stroke-linejoin="round" stroke-miterlimit="10" x1="94.084" y1="99.344" x2="94.084" y2="99.344"/>
		
			<line fill="none" stroke="#33BEE2" stroke-width="2" stroke-linecap="round" stroke-linejoin="round" stroke-miterlimit="10" x1="94.084" y1="99.344" x2="94.084" y2="99.344"/>
		<path fill="none" stroke="#33BEE2" stroke-width="2" stroke-linecap="round" stroke-linejoin="round" stroke-miterlimit="10" d="
			M94.084,99.344"/>
		
			<line fill="none" stroke="#33BEE2" stroke-width="2" stroke-linecap="round" stroke-linejoin="round" stroke-miterlimit="10" x1="94.084" y1="99.344" x2="94.084" y2="99.344"/>
		
			<line fill="none" stroke="#33BEE2" stroke-width="2" stroke-linecap="round" stroke-linejoin="round" stroke-miterlimit="10" x1="94.084" y1="99.344" x2="94.084" y2="99.344"/>
		
			<line fill="none" stroke="#33BEE2" stroke-width="2" stroke-linecap="round" stroke-linejoin="round" stroke-miterlimit="10" x1="94.084" y1="99.344" x2="94.084" y2="99.344"/>
		<path fill="none" stroke="#33BEE2" stroke-width="2" stroke-linecap="round" stroke-linejoin="round" stroke-miterlimit="10" d="
			M94.084,99.345"/>
		
			<line fill="none" stroke="#33BEE2" stroke-width="2" stroke-linecap="round" stroke-linejoin="round" stroke-miterlimit="10" x1="94.084" y1="99.344" x2="94.084" y2="99.344"/>
		
			<line fill="none" stroke="#33BEE2" stroke-width="2" stroke-linecap="round" stroke-linejoin="round" stroke-miterlimit="10" x1="94.084" y1="99.344" x2="94.084" y2="99.344"/>
		
			<line fill="none" stroke="#33BEE2" stroke-width="2" stroke-linecap="round" stroke-linejoin="round" stroke-miterlimit="10" x1="94.084" y1="99.345" x2="94.084" y2="99.344"/>
		
			<line fill="none" stroke="#33BEE2" stroke-width="2" stroke-linecap="round" stroke-linejoin="round" stroke-miterlimit="10" x1="94.084" y1="99.344" x2="94.084" y2="99.344"/>
		
			<line fill="none" stroke="#33BEE2" stroke-width="2" stroke-linecap="round" stroke-linejoin="round" stroke-miterlimit="10" x1="94.084" y1="99.344" x2="94.084" y2="99.344"/>
		
			<line fill="none" stroke="#33BEE2" stroke-width="2" stroke-linecap="round" stroke-linejoin="round" stroke-miterlimit="10" x1="94.084" y1="99.344" x2="94.084" y2="99.344"/>
		
			<line fill="none" stroke="#33BEE2" stroke-width="2" stroke-linecap="round" stroke-linejoin="round" stroke-miterlimit="10" x1="94.084" y1="99.344" x2="94.084" y2="99.344"/>
		
			<line fill="none" stroke="#33BEE2" stroke-width="2" stroke-linecap="round" stroke-linejoin="round" stroke-miterlimit="10" x1="94.084" y1="99.344" x2="94.084" y2="99.344"/>
		
			<line fill="none" stroke="#33BEE2" stroke-width="2" stroke-linecap="round" stroke-linejoin="round" stroke-miterlimit="10" x1="94.084" y1="99.344" x2="94.084" y2="99.344"/>
		
			<line fill="none" stroke="#33BEE2" stroke-width="2" stroke-linecap="round" stroke-linejoin="round" stroke-miterlimit="10" x1="94.084" y1="99.344" x2="94.084" y2="99.344"/>
		
			<line fill="none" stroke="#33BEE2" stroke-width="2" stroke-linecap="round" stroke-linejoin="round" stroke-miterlimit="10" x1="94.084" y1="99.344" x2="94.084" y2="99.344"/>
		
			<line fill="none" stroke="#33BEE2" stroke-width="2" stroke-linecap="round" stroke-linejoin="round" stroke-miterlimit="10" x1="94.084" y1="99.344" x2="94.084" y2="99.344"/>
		<path fill="none" stroke="#33BEE2" stroke-width="2" stroke-linecap="round" stroke-linejoin="round" stroke-miterlimit="10" d="
			M94.084,99.344"/>
		
			<line fill="none" stroke="#33BEE2" stroke-width="2" stroke-linecap="round" stroke-linejoin="round" stroke-miterlimit="10" x1="94.084" y1="99.344" x2="94.084" y2="99.344"/>
		
			<line fill="none" stroke="#33BEE2" stroke-width="2" stroke-linecap="round" stroke-linejoin="round" stroke-miterlimit="10" x1="94.084" y1="99.344" x2="94.084" y2="99.344"/>
		
			<line fill="none" stroke="#33BEE2" stroke-width="2" stroke-linecap="round" stroke-linejoin="round" stroke-miterlimit="10" x1="94.084" y1="99.344" x2="94.084" y2="99.344"/>
		
			<line fill="none" stroke="#33BEE2" stroke-width="2" stroke-linecap="round" stroke-linejoin="round" stroke-miterlimit="10" x1="94.084" y1="99.344" x2="94.084" y2="99.344"/>
		
			<line fill="none" stroke="#33BEE2" stroke-width="2" stroke-linecap="round" stroke-linejoin="round" stroke-miterlimit="10" x1="94.084" y1="99.344" x2="94.084" y2="99.344"/>
		
			<line fill="none" stroke="#33BEE2" stroke-width="2" stroke-linecap="round" stroke-linejoin="round" stroke-miterlimit="10" x1="94.084" y1="99.344" x2="94.084" y2="99.344"/>
		
			<line fill="none" stroke="#33BEE2" stroke-width="2" stroke-linecap="round" stroke-linejoin="round" stroke-miterlimit="10" x1="94.084" y1="99.344" x2="94.084" y2="99.344"/>
		
			<line fill="none" stroke="#33BEE2" stroke-width="2" stroke-linecap="round" stroke-linejoin="round" stroke-miterlimit="10" x1="94.084" y1="99.344" x2="94.084" y2="99.344"/>
		
			<line fill="none" stroke="#33BEE2" stroke-width="2" stroke-linecap="round" stroke-linejoin="round" stroke-miterlimit="10" x1="94.084" y1="99.344" x2="94.084" y2="99.344"/>
		
			<line fill="none" stroke="#33BEE2" stroke-width="2" stroke-linecap="round" stroke-linejoin="round" stroke-miterlimit="10" x1="94.084" y1="99.344" x2="94.084" y2="99.344"/>
		
			<line fill="none" stroke="#33BEE2" stroke-width="2" stroke-linecap="round" stroke-linejoin="round" stroke-miterlimit="10" x1="94.084" y1="99.344" x2="94.084" y2="99.344"/>
		
			<line fill="none" stroke="#33BEE2" stroke-width="2" stroke-linecap="round" stroke-linejoin="round" stroke-miterlimit="10" x1="94.084" y1="99.344" x2="94.084" y2="99.344"/>
		
			<line fill="none" stroke="#33BEE2" stroke-width="2" stroke-linecap="round" stroke-linejoin="round" stroke-miterlimit="10" x1="94.084" y1="99.344" x2="94.084" y2="99.344"/>
		
			<line fill="none" stroke="#33BEE2" stroke-width="2" stroke-linecap="round" stroke-linejoin="round" stroke-miterlimit="10" x1="94.084" y1="99.344" x2="94.084" y2="99.344"/>
		
			<line fill="none" stroke="#33BEE2" stroke-width="2" stroke-linecap="round" stroke-linejoin="round" stroke-miterlimit="10" x1="94.084" y1="99.344" x2="94.084" y2="99.344"/>
		
			<line fill="none" stroke="#33BEE2" stroke-width="2" stroke-linecap="round" stroke-linejoin="round" stroke-miterlimit="10" x1="94.084" y1="99.344" x2="94.084" y2="99.344"/>
		<path fill="none" stroke="#33BEE2" stroke-width="2" stroke-linecap="round" stroke-linejoin="round" stroke-miterlimit="10" d="
			M94.084,99.344"/>
		
			<line fill="none" stroke="#33BEE2" stroke-width="2" stroke-linecap="round" stroke-linejoin="round" stroke-miterlimit="10" x1="94.084" y1="99.344" x2="94.084" y2="99.344"/>
		
			<line fill="none" stroke="#33BEE2" stroke-width="2" stroke-linecap="round" stroke-linejoin="round" stroke-miterlimit="10" x1="94.084" y1="99.344" x2="94.084" y2="99.344"/>
		
			<line fill="none" stroke="#33BEE2" stroke-width="2" stroke-linecap="round" stroke-linejoin="round" stroke-miterlimit="10" x1="94.084" y1="99.344" x2="94.084" y2="99.344"/>
		<path fill="none" stroke="#33BEE2" stroke-width="2" stroke-linecap="round" stroke-linejoin="round" stroke-miterlimit="10" d="
			M94.084,99.344"/>
		
			<line fill="none" stroke="#33BEE2" stroke-width="2" stroke-linecap="round" stroke-linejoin="round" stroke-miterlimit="10" x1="94.084" y1="99.344" x2="94.084" y2="99.344"/>
		
			<line fill="none" stroke="#33BEE2" stroke-width="2" stroke-linecap="round" stroke-linejoin="round" stroke-miterlimit="10" x1="94.084" y1="99.344" x2="94.084" y2="99.344"/>
		
			<line fill="none" stroke="#33BEE2" stroke-width="2" stroke-linecap="round" stroke-linejoin="round" stroke-miterlimit="10" x1="94.084" y1="99.344" x2="94.084" y2="99.344"/>
		
			<line fill="none" stroke="#33BEE2" stroke-width="2" stroke-linecap="round" stroke-linejoin="round" stroke-miterlimit="10" x1="94.084" y1="99.344" x2="94.084" y2="99.344"/>
		
			<line fill="none" stroke="#33BEE2" stroke-width="2" stroke-linecap="round" stroke-linejoin="round" stroke-miterlimit="10" x1="94.084" y1="99.344" x2="94.084" y2="99.344"/>
		
			<line fill="none" stroke="#33BEE2" stroke-width="2" stroke-linecap="round" stroke-linejoin="round" stroke-miterlimit="10" x1="94.084" y1="99.344" x2="94.084" y2="99.344"/>
		
			<line fill="none" stroke="#33BEE2" stroke-width="2" stroke-linecap="round" stroke-linejoin="round" stroke-miterlimit="10" x1="94.084" y1="99.344" x2="94.084" y2="99.344"/>
	</g>
	
		<path display="inline" fill="none" stroke="#3C4852" stroke-width="2" stroke-linecap="round" stroke-linejoin="round" stroke-miterlimit="10" d="
		M121.181,18.265v16.348c0,2.906-1.247,5.652-4.155,5.652H73.88c-2.907,0-5.699-2.746-5.699-5.652V18.265"/>
	
		<polygon display="inline" fill="none" stroke="#3C4852" stroke-width="2" stroke-linecap="round" stroke-linejoin="round" stroke-miterlimit="10" points="
		97.586,59.265 108.522,40.265 81.182,40.265 92.119,59.265 	"/>
	
		<rect x="10.181" y="10.265" display="inline" fill="none" stroke="#3C4852" stroke-width="2" stroke-linecap="round" stroke-linejoin="round" stroke-miterlimit="10" width="158" height="8"/>
	
		<rect x="7.181" y="151.265" display="inline" fill="none" stroke="#3C4852" stroke-width="2" stroke-linecap="round" stroke-linejoin="round" stroke-miterlimit="10" width="158" height="8"/>
	<g display="inline">
		<path fill="none" stroke="#33BEE2" stroke-width="2" stroke-linecap="round" stroke-miterlimit="10" d="M74.38,105.885v18.826
			c0,1.65-1.351,3-3,3H52.553c-1.65,0-3,1.35-3,3v13.311c0,1.65,1.35,3,3,3H71.38c1.649,0,4.351,0,6,0h42.735c1.65,0,3-1.35,3-3
			v-13.311c0-1.65,0-4.35,0-6v-21.826H76.38c-2.624,0-2.562-3.541,0.032-3.541h17.672 M100.057,135.446
			c-5.795,0-10.493-4.698-10.493-10.493s4.698-10.494,10.493-10.494c5.796,0,10.494,4.699,10.494,10.494
			S105.853,135.446,100.057,135.446z"/>
	</g>
</g>
<g id="Layer_5" display="none">
	
		<rect x="9.181" y="147.265" display="inline" fill="none" stroke="#3C4852" stroke-width="2" stroke-linecap="round" stroke-linejoin="round" stroke-miterlimit="10" width="158" height="8"/>
	<g display="inline">
		<path fill="none" stroke="#33BEE2" stroke-width="2" stroke-miterlimit="10" d="M72.608,98.885v21.826c0,1.65-1.351,3-3,3H50.781
			c-1.65,0-3,1.35-3,3v13.311c0,1.65,1.35,3,3,3h18.827c1.649,0,4.351,0,6,0h42.735c1.65,0,3-1.35,3-3v-13.311c0-1.65,0-4.35,0-6
			V98.885H72.608z M98.285,131.446c-5.795,0-10.493-4.698-10.493-10.493s4.698-10.494,10.493-10.494
			c5.796,0,10.494,4.699,10.494,10.494S104.081,131.446,98.285,131.446z"/>
	</g>
	
		<circle display="inline" fill="none" stroke="#3C4852" stroke-width="2" stroke-miterlimit="10" cx="98.63" cy="121.27" r="3.368"/>
	
		<circle display="inline" fill="none" stroke="#3C4852" stroke-width="2" stroke-miterlimit="10" cx="62.507" cy="113.642" r="3.368"/>
	
		<circle display="inline" fill="none" stroke="#3C4852" stroke-width="2" stroke-miterlimit="10" cx="49.878" cy="113.642" r="3.368"/>
	
		<circle display="inline" fill="none" stroke="#3C4852" stroke-width="2" stroke-miterlimit="10" cx="62.507" cy="101.014" r="3.368"/>
	
		<circle display="inline" fill="none" stroke="#3C4852" stroke-width="2" stroke-miterlimit="10" cx="49.878" cy="101.014" r="3.368"/>
	
		<path display="inline" fill="none" stroke="#3C4852" stroke-width="2" stroke-linecap="round" stroke-linejoin="round" stroke-miterlimit="10" d="
		M132.181,23.265v16.348c0,2.906-1.247,5.652-4.155,5.652H54.88c-2.907,0-5.699-2.746-5.699-5.652V23.265"/>
	
		<polygon display="inline" fill="none" stroke="#3C4852" stroke-width="2" stroke-linecap="round" stroke-linejoin="round" stroke-miterlimit="10" points="
		67.586,59.265 75.855,45.265 55.182,45.265 63.452,59.265 	"/>
	
		<polygon display="inline" fill="none" stroke="#3C4852" stroke-width="2" stroke-linecap="round" stroke-linejoin="round" stroke-miterlimit="10" points="
		88.586,59.265 96.855,45.265 76.182,45.265 84.452,59.265 	"/>
	
		<rect x="6.181" y="15.265" display="inline" fill="none" stroke="#3C4852" stroke-width="2" stroke-linecap="round" stroke-linejoin="round" stroke-miterlimit="10" width="158" height="8"/>
	
		<path display="inline" fill="none" stroke="#33BEE2" stroke-width="2" stroke-linecap="round" stroke-linejoin="round" stroke-miterlimit="10" d="
		M72,81.167c0-3.773-6.833-14.084-6.833-14.084s-6.833,10.311-6.833,14.084S61.394,88,65.167,88S72,84.94,72,81.167z"/>
	
		<path display="inline" fill="none" stroke="#33BEE2" stroke-width="2" stroke-linecap="round" stroke-linejoin="round" stroke-miterlimit="10" d="
		M93,81.167c0-3.773-6.833-14.084-6.833-14.084s-6.833,10.311-6.833,14.084S82.394,88,86.167,88S93,84.94,93,81.167z"/>
	<g display="inline">
		<path fill="none" stroke="#F7B01E" stroke-width="2" stroke-linecap="round" stroke-linejoin="round" stroke-miterlimit="10" d="
			M106.334,62c0,2.397-4,2.397-4,4.795s4,2.398,4,4.796c0,2.4-4,2.4-4,4.801c0,2.402,4,2.402,4,4.804s-4,2.402-4,4.804"/>
	</g>
	<g display="inline">
		<path fill="none" stroke="#F7B01E" stroke-width="2" stroke-linecap="round" stroke-linejoin="round" stroke-miterlimit="10" d="
			M112.334,62c0,2.397-4,2.397-4,4.795s4,2.398,4,4.796c0,2.4-4,2.4-4,4.801c0,2.402,4,2.402,4,4.804s-4,2.402-4,4.804"/>
	</g>
	<g display="inline">
		<path fill="none" stroke="#F7B01E" stroke-width="2" stroke-linecap="round" stroke-linejoin="round" stroke-miterlimit="10" d="
			M118.334,62c0,2.397-4,2.397-4,4.795s4,2.398,4,4.796c0,2.4-4,2.4-4,4.801c0,2.402,4,2.402,4,4.804s-4,2.402-4,4.804"/>
	</g>
	
		<path display="inline" fill="none" stroke="#3C4852" stroke-width="2" stroke-linecap="round" stroke-linejoin="round" stroke-miterlimit="10" d="
		M112.334,56.933c6.445,0,11.668-5.668,11.668-11.668h-23.336C100.666,51.265,105.89,56.933,112.334,56.933z"/>
	
		<path display="inline" fill="none" stroke="#3C4852" stroke-width="2" stroke-linecap="round" stroke-linejoin="round" stroke-miterlimit="10" d="
		M112.334,53.285c4.43,0,8.021-4.021,8.021-8.021h-16.042C104.313,49.265,107.904,53.285,112.334,53.285z"/>
</g>
<g id="Layer_6" display="none">
	
		<path display="inline" fill="none" stroke="#3C4852" stroke-width="2" stroke-linecap="round" stroke-linejoin="round" stroke-miterlimit="10" d="
		M121.181,19.265v16.348c0,2.906-1.247,5.652-4.155,5.652H73.88c-2.907,0-5.699-2.746-5.699-5.652V19.265"/>
	
		<polygon display="inline" fill="none" stroke="#3C4852" stroke-width="2" stroke-linecap="round" stroke-linejoin="round" stroke-miterlimit="10" points="
		100.586,60.265 108.522,41.265 81.182,41.265 89.119,60.265 	"/>
	
		<rect x="6.181" y="151.265" display="inline" fill="none" stroke="#3C4852" stroke-width="2" stroke-linecap="round" stroke-linejoin="round" stroke-miterlimit="10" width="158" height="8"/>
	<g display="inline">
		<path fill="none" stroke="#33BEE2" stroke-width="2" stroke-miterlimit="10" d="M72.608,102.885v21.826c0,1.65-1.351,3-3,3H50.781
			c-1.65,0-3,1.35-3,3v13.311c0,1.65,1.35,3,3,3h18.827c1.649,0,4.351,0,6,0h42.735c1.65,0,3-1.35,3-3v-13.311c0-1.65,0-4.35,0-6
			v-21.826H72.608z M98.285,135.446c-5.795,0-10.493-4.698-10.493-10.493s4.698-10.494,10.493-10.494
			c5.796,0,10.494,4.699,10.494,10.494S104.081,135.446,98.285,135.446z"/>
	</g>
	
		<rect x="6.181" y="10.265" display="inline" fill="none" stroke="#3C4852" stroke-width="2" stroke-linecap="round" stroke-linejoin="round" stroke-miterlimit="10" width="158" height="8"/>
	<g display="inline">
		
			<circle fill="none" stroke="#33BEE2" stroke-width="2" stroke-linecap="round" stroke-linejoin="round" stroke-miterlimit="10" cx="94.74" cy="65.719" r="1.656"/>
		
			<circle fill="none" stroke="#33BEE2" stroke-width="2" stroke-linecap="round" stroke-linejoin="round" stroke-miterlimit="10" cx="94.74" cy="73.719" r="1.656"/>
		
			<circle fill="none" stroke="#33BEE2" stroke-width="2" stroke-linecap="round" stroke-linejoin="round" stroke-miterlimit="10" cx="94.74" cy="81.719" r="1.656"/>
		
			<circle fill="none" stroke="#33BEE2" stroke-width="2" stroke-linecap="round" stroke-linejoin="round" stroke-miterlimit="10" cx="94.74" cy="89.719" r="1.656"/>
		
			<circle fill="none" stroke="#33BEE2" stroke-width="2" stroke-linecap="round" stroke-linejoin="round" stroke-miterlimit="10" cx="94.74" cy="97.719" r="1.656"/>
	</g>
	<g display="inline">
		
			<circle fill="none" stroke="#33BEE2" stroke-width="2" stroke-linecap="round" stroke-linejoin="round" stroke-miterlimit="10" cx="101.329" cy="65.902" r="1.657"/>
		
			<circle fill="none" stroke="#33BEE2" stroke-width="2" stroke-linecap="round" stroke-linejoin="round" stroke-miterlimit="10" cx="102.535" cy="73.81" r="1.656"/>
		
			<circle fill="none" stroke="#33BEE2" stroke-width="2" stroke-linecap="round" stroke-linejoin="round" stroke-miterlimit="10" cx="103.74" cy="81.719" r="1.656"/>
		
			<circle fill="none" stroke="#33BEE2" stroke-width="2" stroke-linecap="round" stroke-linejoin="round" stroke-miterlimit="10" cx="104.946" cy="89.627" r="1.656"/>
		
			<circle fill="none" stroke="#33BEE2" stroke-width="2" stroke-linecap="round" stroke-linejoin="round" stroke-miterlimit="10" cx="106.151" cy="97.536" r="1.657"/>
	</g>
	<g display="inline">
		
			<circle fill="none" stroke="#33BEE2" stroke-width="2" stroke-linecap="round" stroke-linejoin="round" stroke-miterlimit="10" cx="88.151" cy="65.902" r="1.657"/>
		
			<circle fill="none" stroke="#33BEE2" stroke-width="2" stroke-linecap="round" stroke-linejoin="round" stroke-miterlimit="10" cx="86.946" cy="73.81" r="1.656"/>
		
			<circle fill="none" stroke="#33BEE2" stroke-width="2" stroke-linecap="round" stroke-linejoin="round" stroke-miterlimit="10" cx="85.741" cy="81.719" r="1.656"/>
		
			<circle fill="none" stroke="#33BEE2" stroke-width="2" stroke-linecap="round" stroke-linejoin="round" stroke-miterlimit="10" cx="84.535" cy="89.627" r="1.656"/>
		
			<circle fill="none" stroke="#33BEE2" stroke-width="2" stroke-linecap="round" stroke-linejoin="round" stroke-miterlimit="10" cx="83.329" cy="97.536" r="1.657"/>
	</g>
</g>
<g id="Layer_7" display="none">
</g>
</svg>
