<?xml version="1.0" encoding="UTF-8"?>
<svg width="8px" height="5px" viewBox="0 0 8 5" version="1.1" xmlns="http://www.w3.org/2000/svg" xmlns:xlink="http://www.w3.org/1999/xlink">
    <!-- Generator: Sketch 43.2 (39069) - http://www.bohemiancoding.com/sketch -->
    <title>Shape</title>
    <desc>Created with Sketch.</desc>
    <defs></defs>
    <g id="Page-1" stroke="none" stroke-width="1" fill="none" fill-rule="evenodd">
        <g id="Artboard" transform="translate(-140.000000, -35.000000)" fill-rule="nonzero" fill="#538A9F">
            <g id="Group-80" transform="translate(25.000000, 23.000000)">
                <g id="noun_996782_cc" transform="translate(115.000000, 12.000000)">
                    <polygon id="Shape" transform="translate(4.311940, 2.122988) rotate(-270.000000) translate(-4.311940, -2.122988) " points="6.31193961 2.1228082 2.31193961 -1.37701238 2.31193961 5.62298762 6.31193961 2.12316705"></polygon>
                </g>
            </g>
        </g>
    </g>
</svg>