<svg width="148" height="43" viewBox="0 0 148 43" fill="none" xmlns="http://www.w3.org/2000/svg">
<rect y="0.404785" width="148" height="42" rx="21" fill="white" fill-opacity="0.08"/>
<path d="M45.04 14.4448L41.14 28.4048H37.84L35.22 18.4648L32.48 28.4048L29.2 28.4248L25.44 14.4448H28.44L30.9 25.2848L33.74 14.4448H36.86L39.54 25.2248L42.02 14.4448H45.04ZM58.4483 14.4448V28.4048H55.6483V22.4648H49.6683V28.4048H46.8683V14.4448H49.6683V20.1848H55.6483V14.4448H58.4483ZM67.6842 28.5448C66.3776 28.5448 65.1776 28.2381 64.0842 27.6248C62.9909 27.0115 62.1242 26.1648 61.4842 25.0848C60.8442 23.9915 60.5242 22.7581 60.5242 21.3848C60.5242 20.0248 60.8442 18.8048 61.4842 17.7248C62.1242 16.6315 62.9909 15.7781 64.0842 15.1648C65.1776 14.5515 66.3776 14.2448 67.6842 14.2448C69.0042 14.2448 70.2042 14.5515 71.2842 15.1648C72.3776 15.7781 73.2376 16.6315 73.8642 17.7248C74.5042 18.8048 74.8242 20.0248 74.8242 21.3848C74.8242 22.7581 74.5042 23.9915 73.8642 25.0848C73.2376 26.1648 72.3776 27.0115 71.2842 27.6248C70.1909 28.2381 68.9909 28.5448 67.6842 28.5448ZM67.6842 26.0448C68.5242 26.0448 69.2642 25.8581 69.9042 25.4848C70.5442 25.0981 71.0442 24.5515 71.4042 23.8448C71.7642 23.1381 71.9442 22.3181 71.9442 21.3848C71.9442 20.4515 71.7642 19.6381 71.4042 18.9448C71.0442 18.2381 70.5442 17.6981 69.9042 17.3248C69.2642 16.9515 68.5242 16.7648 67.6842 16.7648C66.8442 16.7648 66.0976 16.9515 65.4442 17.3248C64.8042 17.6981 64.3042 18.2381 63.9442 18.9448C63.5842 19.6381 63.4042 20.4515 63.4042 21.3848C63.4042 22.3181 63.5842 23.1381 63.9442 23.8448C64.3042 24.5515 64.8042 25.0981 65.4442 25.4848C66.0976 25.8581 66.8442 26.0448 67.6842 26.0448ZM84.473 14.4448V28.4048H81.673V14.4448H84.473ZM100.565 25.7448H95.005L94.085 28.4048H91.145L96.165 14.4248H99.425L104.445 28.4048H101.485L100.565 25.7448ZM99.805 23.5048L97.785 17.6648L95.765 23.5048H99.805ZM121.541 14.4448V28.4048H118.741V19.3248L115.001 28.4048H112.881L109.121 19.3248V28.4048H106.321V14.4448H109.501L113.941 24.8248L118.381 14.4448H121.541Z" fill="#FFB742"/>
</svg>
