<svg width="334" height="116" viewBox="0 0 334 116" fill="none" xmlns="http://www.w3.org/2000/svg">
<g filter="url(#filter0_d_0_144)">
<path d="M6 4H278C291.261 4 303.979 8.97518 313.355 17.8311C322.732 26.687 328 38.6981 328 51.2222V58.7778C328 64.9791 326.707 71.1197 324.194 76.8489C321.681 82.5782 317.998 87.7839 313.355 92.1689C308.712 96.5539 303.2 100.032 297.134 102.405C291.068 104.779 284.566 106 278 106H6V4Z" fill="white"/>
<path d="M7 4.47217H278C291.128 4.47217 303.719 9.3976 313.002 18.1649C322.285 26.9323 327.5 38.8233 327.5 51.2222V58.7777C327.5 71.1766 322.285 83.0676 313.002 91.835C303.719 100.602 291.128 105.528 278 105.528H7C6.86739 105.528 6.74021 105.478 6.64645 105.389C6.55268 105.301 6.5 105.181 6.5 105.056V4.94439C6.5 4.81915 6.55268 4.69904 6.64645 4.61048C6.74021 4.52192 6.86739 4.47217 7 4.47217V4.47217Z" stroke="#707070"/>
</g>
<defs>
<filter id="filter0_d_0_144" x="0" y="0.972168" width="334" height="114.056" filterUnits="userSpaceOnUse" color-interpolation-filters="sRGB">
<feFlood flood-opacity="0" result="BackgroundImageFix"/>
<feColorMatrix in="SourceAlpha" type="matrix" values="0 0 0 0 0 0 0 0 0 0 0 0 0 0 0 0 0 0 127 0" result="hardAlpha"/>
<feOffset dy="3"/>
<feGaussianBlur stdDeviation="3"/>
<feColorMatrix type="matrix" values="0 0 0 0 0 0 0 0 0 0 0 0 0 0 0 0 0 0 0.161 0"/>
<feBlend mode="normal" in2="BackgroundImageFix" result="effect1_dropShadow_0_144"/>
<feBlend mode="normal" in="SourceGraphic" in2="effect1_dropShadow_0_144" result="shape"/>
</filter>
</defs>
</svg>

