



    01234
	/    \
   /      \
01232     01236










  {mem=0x00eecfc2 "0123456789201234567893012345678940123456789501234567896012345657897012345678980123456789901234567890012345678910123456789201234567893012345678910ýýýýÝ\x1¨Ý½Cƒ" ...} final

  
  
  
  {mem=0x0006cfbb "45678910123456789201234567893012345678940123456789501234567896012345657897012345678980123456789901234567890012345678910123456789201234567893012345678910ýýýýÝ4»zR×¼" ...}
  {mem=0x0006cfcf "234567893012345678940123456789501234567896012345657897012345678980123456789901234567890012345678910123456789201234567893012345678910ýýýýÝ4»zR×¼" ...}
  {mem=0x0006cfc3 "123456789201234567893012345678940123456789501234567896012345657897012345678980123456789901234567890012345678910123456789201234567893012345678910ýýýýÝ4»zR×¼" ...}
  {mem=0x0006cfe3 "0123456789501234567896012345657897012345678980123456789901234567890012345678910123456789201234567893012345678910ýýýýÝ4»zR×¼" ...}
  {mem=0x0006cfc1 "10123456789201234567893012345678940123456789501234567896012345657897012345678980123456789901234567890012345678910123456789201234567893012345678910ýýýýÝ4»zR×¼" ...}
  {mem=0x0006d005 "012345678980123456789901234567890012345678910123456789201234567893012345678910ýýýýÝ4»zR×¼" ...}
  {mem=0x0006d052 "0ýýýýÝ4»zR×¼" size=1 index=154 ...}
  {mem=0x0006d010 "0123456789901234567890012345678910123456789201234567893012345678910ýýýýÝ4»zR×¼" size=...}
  {mem=0x0006d052 "0ýýýýÝ4»zR×¼" size=1 index=154 ...}
  


to find  {mem=0x0132207b "012345689dsrfposdkpo23456kbdsmtg;mdsvmxbv123456fl'asl';vl[xzclv[]" size=91 index=-1 ...}
  

		[0]	{mem=0x0006d025 "0012345678910123456789201234567893012345678910ýýýýÝ4»zR×¼" size=46 index=109 ...}	needle::CacheItem
		[1]	{mem=0x0006cff9 "012345657897012345678980123456789901234567890012345678910123456789201234567893012345678910ýýýýÝ4»zR×¼" ...}	needle::CacheItem
		[2]	{mem=0x0006d01b "01234567890012345678910123456789201234567893012345678910ýýýýÝ4»zR×¼" size=56 index=...}	needle::CacheItem
		[3]	{mem=0x0006d026 "012345678910123456789201234567893012345678910ýýýýÝ4»zR×¼" size=45 index=110 ...}	needle::CacheItem
		[4]	{mem=0x0006d047 "012345678910ýýýýÝ4»zR×¼" size=12 index=143 ...}	needle::CacheItem
		[5]	{mem=0x0006d031 "0123456789201234567893012345678910ýýýýÝ4»zR×¼" size=34 index=121 ...}	needle::CacheItem
		[6]	{mem=0x0006cfc2 "0123456789201234567893012345678940123456789501234567896012345657897012345678980123456789901234567890012345678910123456789201234567893012345678910ýýýýÝ4»zR×¼" ...}	needle::CacheItem
		[7]	{mem=0x0006d03c "01234567893012345678910ýýýýÝ4»zR×¼" size=23 index=132 ...}	needle::CacheItem
		[8]	{mem=0x0006cfcd "01234567893012345678940123456789501234567896012345657897012345678980123456789901234567890012345678910123456789201234567893012345678910ýýýýÝ4»zR×¼" ...}	needle::CacheItem
		[9]	{mem=0x0006cfd8 "012345678940123456789501234567896012345657897012345678980123456789901234567890012345678910123456789201234567893012345678910ýýýýÝ4»zR×¼" ...}	needle::CacheItem
1		[10]{mem=0x0006cfe3 "0123456789501234567896012345657897012345678980123456789901234567890012345678910123456789201234567893012345678910ýýýýÝ4»zR×¼" ...}	needle::CacheItem
		[11]{mem=0x0006cfee "01234567896012345657897012345678980123456789901234567890012345678910123456789201234567893012345678910ýýýýÝ4»zR×¼" ...}	needle::CacheItem
2		[12]{mem=0x0006d005 "012345678980123456789901234567890012345678910123456789201234567893012345678910ýýýýÝ4»zR×¼" ...}	needle::CacheItem
4		[13]{mem=0x0006d010 "0123456789901234567890012345678910123456789201234567893012345678910ýýýýÝ4»zR×¼" size=...}	needle::CacheItem
3,5		[14]{mem=0x0006d052 "0ýýýýÝ4»zR×¼" size=1 index=154 ...}	needle::CacheItem



