{
  "en": {
    "id": "2",
    "meta": {
      "title": "About Us",
      "description": "Learn more about EcoTech, our mission, and our commitment to sustainability."
    },
    "components": [
      {
        "type": "title",
        "content": "About Us"
      },
      {
        "type": "hero",
        "image": "about-us-hero.jpg",
        "altText": "EcoTech team",
        "caption": "Meet the EcoTech Team"
      },
      {
        "type": "textblock",
        "content": "Founded in 2010, EcoTech has been pioneering eco-friendly technologies that make a difference in our communities. We're not just a company; we're a movement towards a greener, cleaner future."
      },
      {
        "type": "textblock",
        "content": "Our products range from sustainable energy solutions to waste management systems, all designed to minimize environmental impact."
      },
      {
        "type": "cta",
        "buttonText": "Join Us",
        "link": "/careers"
      }
    ]
  },
  "de": {
    "id": "2",
    "meta": {
      "title": "Über Uns",
      "description": "Erfahren Sie mehr über EcoTech, unsere Mission und unser Engagement für Nachhaltigkeit."
    },
    "components": [
      {
        "type": "title",
        "content": "Über Uns"
      },
      {
        "type": "hero",
        "image": "about-us-hero.jpg",
        "altText": "EcoTech Team",
        "caption": "Treffen Sie das EcoTech Team"
      },
      {
        "type": "textblock",
        "content": "Gegründet im Jahr 2010, hat EcoTech bahnbrechende umweltfreundliche Technologien entwickelt, die einen Unterschied in unseren Gemeinschaften machen. Wir sind nicht nur ein Unternehmen; wir sind eine Bewegung in Richtung einer grüneren, saubereren Zukunft."
      },
      {
        "type": "textblock",
        "content": "Unsere Produkte reichen von nachhaltigen Energielösungen bis hin zu Abfallwirtschaftssystemen, alle darauf ausgelegt, die Umweltauswirkungen zu minimieren."
      },
      {
        "type": "cta",
        "buttonText": "Machen Sie mit",
        "link": "/careers"
      }
    ]
  }
}
