{
  "en": {
    "id": "3",
    "meta": {
      "title": "Products",
      "description": "Explore our range of sustainable products."
    },
    "components": [
      {
        "type": "title",
        "content": "Our Products"
      },
      {
        "type": "textblock",
        "content": "From renewable energy solutions to waste management systems, we have a variety of products to meet your eco-friendly needs."
      },
      {
        "type": "cta",
        "buttonText": "Contact Us",
        "link": "/contact-us"
      }
    ]
  },
  "de": {
    "id": "3",
    "meta": {
      "title": "Produkte",
      "description": "Entdecken Sie unsere Palette an nachhaltigen Produkten."
    },
    "components": [
      {
        "type": "title",
        "content": "Unsere Produkte"
      },
      {
        "type": "textblock",
        "content": "Von erneuerbaren Energielösungen bis hin zu Abfallwirtschaftssystemen haben wir eine Vielzahl von Produkten, die Ihren umweltfreundlichen Bedürfnissen entsprechen."
      },
      {
        "type": "cta",
        "buttonText": "Kontaktieren Sie uns",
        "link": "/contact-us"
      }
    ]
  }
}
