{
  "en": {
    "id": "4",
    "meta": {
      "title": "Careers",
      "description": "Join our team and make a difference."
    },
    "components": [
      {
        "type": "title",
        "content": "Careers at EcoTech"
      },
      {
        "type": "textblock",
        "content": "We're always looking for passionate individuals to join our team. If you're excited about creating a more sustainable future, we'd love to hear from you."
      },
      {
        "type": "cta",
        "buttonText": "Contact Us",
        "link": "/contact-us"
      }
    ]
  },
  "de": {
    "id": "4",
    "meta": {
      "title": "Karriere",
      "description": "Treten Sie unserem Team bei und machen Sie einen Unterschied."
    },
    "components": [
      {
        "type": "title",
        "content": "Karriere bei EcoTech"
      },
      {
        "type": "textblock",
        "content": "Wir suchen immer nach leidenschaftlichen Einzelpersonen, die unserem Team beitreten möchten. Wenn Sie sich für eine nachhaltigere Zukunft begeistern, würden wir gerne von Ihnen hören."
      },
      {
        "type": "cta",
        "buttonText": "Kontaktieren Sie uns",
        "link": "/contact-us"
      }
    ]
  }
}
