{
  "Field": {
    "Default": {
      "value": "{2,5x}",
      "type": "borderRadius"
    }
  },
  "Btn": {
    "Primary": {
      "value": "{4x}",
      "type": "borderRadius"
    }
  },
  "Modal": {
    "Center": {
      "value": "{4x}",
      "type": "borderRadius"
    }
  }
}