[
  {
    "model": "shopapp.order",
    "pk": 1,
    "fields": {
      "delivery_adress": "adress",
      "promocode": "",
      "created_at": "2023-06-27",
      "user": 1,
      "products": [
        2,
        1,
        6,
        3,
        4,
        5
      ]
    }
  },
  {
    "model": "shopapp.order",
    "pk": 2,
    "fields": {
      "delivery_adress": "Some Adress",
      "promocode": "1",
      "created_at": "2023-06-30",
      "user": 1,
      "products": [
        2
      ]
    }
  },
  {
    "model": "shopapp.order",
    "pk": 3,
    "fields": {
      "delivery_adress": "Next adress",
      "promocode": "promo",
      "created_at": "2023-06-30",
      "user": 1,
      "products": [
        2,
        1,
        3
      ]
    }
  },
  {
    "model": "shopapp.order",
    "pk": 4,
    "fields": {
      "delivery_adress": "Test",
      "promocode": "t",
      "created_at": "2023-07-10",
      "user": 1,
      "products": [
        2
      ]
    }
  },
  {
    "model": "shopapp.order",
    "pk": 7,
    "fields": {
      "delivery_adress": "TestOrder",
      "promocode": "promo",
      "created_at": "2023-07-17",
      "user": 3,
      "products": [
        2,
        6
      ]
    }
  },
  {
    "model": "shopapp.order",
    "pk": 8,
    "fields": {
      "delivery_adress": "",
      "promocode": "some promo",
      "created_at": "2023-07-19",
      "user": 1,
      "products": [
        1
      ]
    }
  },
  {
    "model": "shopapp.order",
    "pk": 9,
    "fields": {
      "delivery_adress": "Adress",
      "promocode": "Promo",
      "created_at": "2023-07-20",
      "user": 1,
      "products": [
        2
      ]
    }
  }
]