G04 #@! TF.GenerationSoftware,KiCad,Pcbnew,(5.0.0-3-g5ebb6b6)*
G04 #@! TF.CreationDate,2019-03-28T22:41:46+01:00*
G04 #@! TF.ProjectId,WakeupLite,57616B6575704C6974652E6B69636164,rev?*
G04 #@! TF.SameCoordinates,Original*
G04 #@! TF.FileFunction,Legend,Bot*
G04 #@! TF.FilePolarity,Positive*
%FSLAX46Y46*%
G04 Gerber Fmt 4.6, Leading zero omitted, Abs format (unit mm)*
G04 Created by KiCad (PCBNEW (5.0.0-3-g5ebb6b6)) date Thursday, 28. March 2019 um 22:41:46*
%MOMM*%
%LPD*%
G01*
G04 APERTURE LIST*
%ADD10C,0.120000*%
%ADD11C,0.150000*%
G04 APERTURE END LIST*
D10*
G04 #@! TO.C,J1*
X189866586Y-104771773D02*
X189374182Y-104684950D01*
X189995085Y-104043015D02*
X189866586Y-104771773D01*
X174218601Y-98075802D02*
X174256899Y-98129265D01*
X172355541Y-95413844D02*
X172383758Y-95455375D01*
X173991025Y-98255006D02*
X174019415Y-98295552D01*
X172117884Y-95581116D02*
X172156183Y-95634579D01*
X179142639Y-98944043D02*
X179180938Y-98997505D01*
X177279580Y-96282085D02*
X177307797Y-96323616D01*
X178915064Y-99123247D02*
X178943454Y-99163793D01*
X177041922Y-96449357D02*
X177080221Y-96502820D01*
X184066678Y-99812284D02*
X184104976Y-99865746D01*
X182203618Y-97150326D02*
X182231835Y-97191856D01*
X183839102Y-99991488D02*
X183867493Y-100032034D01*
X181965961Y-97317598D02*
X182004259Y-97371061D01*
X171579354Y-91229491D02*
X169856591Y-100999768D01*
X191394671Y-94723466D02*
X189671907Y-104493743D01*
X189671907Y-104493743D02*
X169856591Y-100999768D01*
X191394671Y-94723466D02*
X171579354Y-91229491D01*
X190880672Y-97638497D02*
X171065356Y-94144522D01*
X190029623Y-102465039D02*
X170214306Y-98971065D01*
X189769150Y-103942251D02*
X169953834Y-100448275D01*
X174867884Y-96855277D02*
G75*
G03X174867884Y-96855277I-1680000J0D01*
G01*
X179791922Y-97723518D02*
G75*
G03X179791922Y-97723518I-1680000J0D01*
G01*
X184715961Y-98591759D02*
G75*
G03X184715961Y-98591759I-1680000J0D01*
G01*
X187639861Y-101109725D02*
G75*
G03X188367059Y-101090455I320139J1649725D01*
G01*
X189353491Y-100399289D02*
G75*
G03X189590455Y-99052941I-1393491J939289D01*
G01*
X188899289Y-98066509D02*
G75*
G03X187552941Y-97829545I-939289J-1393491D01*
G01*
X186566509Y-98520711D02*
G75*
G03X186329545Y-99867059I1393491J-939289D01*
G01*
X187020556Y-100852783D02*
G75*
G03X187668271Y-101114477I939444J1392783D01*
G01*
G04 #@! TO.C,J2*
X105179444Y-81927217D02*
G75*
G03X104531729Y-81665523I-939444J-1392783D01*
G01*
X105633491Y-84259289D02*
G75*
G03X105870455Y-82912941I-1393491J939289D01*
G01*
X103300711Y-84713491D02*
G75*
G03X104647059Y-84950455I939289J1393491D01*
G01*
X102846509Y-82380711D02*
G75*
G03X102609545Y-83727059I1393491J-939289D01*
G01*
X104560139Y-81670275D02*
G75*
G03X103832941Y-81689545I-320139J-1649725D01*
G01*
X110844039Y-84188241D02*
G75*
G03X110844039Y-84188241I-1680000J0D01*
G01*
X115768078Y-85056482D02*
G75*
G03X115768078Y-85056482I-1679999J0D01*
G01*
X120692116Y-85924723D02*
G75*
G03X120692116Y-85924723I-1680000J0D01*
G01*
X102430850Y-78837749D02*
X122246166Y-82331724D01*
X102170377Y-80314961D02*
X121985694Y-83808935D01*
X101319328Y-85141503D02*
X121134644Y-88635478D01*
X100805329Y-88056534D02*
X120620646Y-91550509D01*
X102528093Y-78286257D02*
X122343409Y-81780233D01*
X100805329Y-88056534D02*
X102528093Y-78286257D01*
X120620646Y-91550509D02*
X122343409Y-81780233D01*
X110234039Y-85462402D02*
X110195741Y-85408939D01*
X108360898Y-82788512D02*
X108332507Y-82747966D01*
X109996382Y-85629674D02*
X109968165Y-85588144D01*
X108133322Y-82967716D02*
X108095024Y-82914254D01*
X115158078Y-86330643D02*
X115119779Y-86277180D01*
X113284936Y-83656753D02*
X113256546Y-83616207D01*
X114920420Y-86497915D02*
X114892202Y-86456384D01*
X113057361Y-83835957D02*
X113019062Y-83782495D01*
X120082116Y-87198884D02*
X120043818Y-87145421D01*
X118208975Y-84524994D02*
X118180585Y-84484448D01*
X119844459Y-87366156D02*
X119816242Y-87324625D01*
X117981399Y-84704198D02*
X117943101Y-84650735D01*
X102204915Y-78736985D02*
X102333414Y-78008227D01*
X102333414Y-78008227D02*
X102825818Y-78095051D01*
G04 #@! TO.C,J1*
D11*
X182084341Y-91511325D02*
X181960306Y-92214759D01*
X181982395Y-92363715D01*
X182059648Y-92474044D01*
X182192066Y-92545746D01*
X182285857Y-92562284D01*
X180925885Y-92322484D02*
X181488632Y-92421712D01*
X181207259Y-92372098D02*
X181380907Y-91387290D01*
X181449891Y-91544515D01*
X181527144Y-91654844D01*
X181612667Y-91718278D01*
G04 #@! TO.C,J2*
X110962383Y-90305841D02*
X110838348Y-91009275D01*
X110860437Y-91158231D01*
X110937690Y-91268560D01*
X111070108Y-91340262D01*
X111163899Y-91356800D01*
X110523784Y-90325211D02*
X110485158Y-90270047D01*
X110399636Y-90206613D01*
X110165157Y-90165268D01*
X110063097Y-90195626D01*
X110007933Y-90234253D01*
X109944499Y-90319775D01*
X109927961Y-90413566D01*
X109950050Y-90562522D01*
X110413570Y-91224497D01*
X109803927Y-91117000D01*
G04 #@! TD*
M02*
