EESchema Schematic File Version 4
LIBS:power
LIBS:device
LIBS:74xx
LIBS:audio
LIBS:interface
LIBS:WakeupLite-cache
EELAYER 26 0
EELAYER END
$Descr A4 11693 8268
encoding utf-8
Sheet 1 1
Title "WakeupLite"
Date "2018-12-25"
Rev "0.1"
Comp ""
Comment1 ""
Comment2 ""
Comment3 ""
Comment4 ""
$EndDescr
$Comp
L LED_5050_RGB:SMD-RGB-HI-LIGHT(6P-L5.0*W5.0*H1.5MM) D23
U 1 1 5C223E7E
P 7300 2950
F 0 "D23" H 7300 3267 50  0000 C CNN
F 1 "SMD-RGB-HI-LIGHT(6P-L5.0*W5.0*H1.5MM)" H 7300 3176 50  0000 C CNN
F 2 "LED_SMD:LED_RGB_5050-6" H 7300 2950 50  0001 L BNN
F 3 "Chengguangxing" H 7300 2950 50  0001 L BNN
F 4 "None" H 7300 2950 50  0001 L BNN "Feld4"
F 5 "SMD RGB Hi-Light" H 7300 2950 50  0001 L BNN "Feld5"
F 6 "5050RGB" H 7300 2950 50  0001 L BNN "Feld6"
F 7 "None" H 7300 2950 50  0001 L BNN "Feld7"
F 8 "Unavailable" H 7300 2950 50  0001 L BNN "Feld8"
	1    7300 2950
	1    0    0    -1  
$EndComp
$Comp
L LED_5050_RGB:SMD-RGB-HI-LIGHT(6P-L5.0*W5.0*H1.5MM) D22
U 1 1 5C224274
P 7300 2450
F 0 "D22" H 7300 2767 50  0000 C CNN
F 1 "SMD-RGB-HI-LIGHT(6P-L5.0*W5.0*H1.5MM)" H 7300 2676 50  0000 C CNN
F 2 "LED_SMD:LED_RGB_5050-6" H 7300 2450 50  0001 L BNN
F 3 "Chengguangxing" H 7300 2450 50  0001 L BNN
F 4 "None" H 7300 2450 50  0001 L BNN "Feld4"
F 5 "SMD RGB Hi-Light" H 7300 2450 50  0001 L BNN "Feld5"
F 6 "5050RGB" H 7300 2450 50  0001 L BNN "Feld6"
F 7 "None" H 7300 2450 50  0001 L BNN "Feld7"
F 8 "Unavailable" H 7300 2450 50  0001 L BNN "Feld8"
	1    7300 2450
	1    0    0    -1  
$EndComp
$Comp
L LED_5050_RGB:SMD-RGB-HI-LIGHT(6P-L5.0*W5.0*H1.5MM) D21
U 1 1 5C22429F
P 7300 1950
F 0 "D21" H 7300 2267 50  0000 C CNN
F 1 "SMD-RGB-HI-LIGHT(6P-L5.0*W5.0*H1.5MM)" H 7300 2176 50  0000 C CNN
F 2 "LED_SMD:LED_RGB_5050-6" H 7300 1950 50  0001 L BNN
F 3 "Chengguangxing" H 7300 1950 50  0001 L BNN
F 4 "None" H 7300 1950 50  0001 L BNN "Feld4"
F 5 "SMD RGB Hi-Light" H 7300 1950 50  0001 L BNN "Feld5"
F 6 "5050RGB" H 7300 1950 50  0001 L BNN "Feld6"
F 7 "None" H 7300 1950 50  0001 L BNN "Feld7"
F 8 "Unavailable" H 7300 1950 50  0001 L BNN "Feld8"
	1    7300 1950
	1    0    0    -1  
$EndComp
$Comp
L LED_5050_RGB:SMD-RGB-HI-LIGHT(6P-L5.0*W5.0*H1.5MM) D28
U 1 1 5C2242F7
P 8300 2950
F 0 "D28" H 8300 3267 50  0000 C CNN
F 1 "SMD-RGB-HI-LIGHT(6P-L5.0*W5.0*H1.5MM)" H 8300 3176 50  0000 C CNN
F 2 "LED_SMD:LED_RGB_5050-6" H 8300 2950 50  0001 L BNN
F 3 "Chengguangxing" H 8300 2950 50  0001 L BNN
F 4 "None" H 8300 2950 50  0001 L BNN "Feld4"
F 5 "SMD RGB Hi-Light" H 8300 2950 50  0001 L BNN "Feld5"
F 6 "5050RGB" H 8300 2950 50  0001 L BNN "Feld6"
F 7 "None" H 8300 2950 50  0001 L BNN "Feld7"
F 8 "Unavailable" H 8300 2950 50  0001 L BNN "Feld8"
	1    8300 2950
	1    0    0    -1  
$EndComp
$Comp
L LED_5050_RGB:SMD-RGB-HI-LIGHT(6P-L5.0*W5.0*H1.5MM) D27
U 1 1 5C224358
P 8300 2450
F 0 "D27" H 8300 2767 50  0000 C CNN
F 1 "SMD-RGB-HI-LIGHT(6P-L5.0*W5.0*H1.5MM)" H 8300 2676 50  0000 C CNN
F 2 "LED_SMD:LED_RGB_5050-6" H 8300 2450 50  0001 L BNN
F 3 "Chengguangxing" H 8300 2450 50  0001 L BNN
F 4 "None" H 8300 2450 50  0001 L BNN "Feld4"
F 5 "SMD RGB Hi-Light" H 8300 2450 50  0001 L BNN "Feld5"
F 6 "5050RGB" H 8300 2450 50  0001 L BNN "Feld6"
F 7 "None" H 8300 2450 50  0001 L BNN "Feld7"
F 8 "Unavailable" H 8300 2450 50  0001 L BNN "Feld8"
	1    8300 2450
	1    0    0    -1  
$EndComp
$Comp
L LED_5050_RGB:SMD-RGB-HI-LIGHT(6P-L5.0*W5.0*H1.5MM) D26
U 1 1 5C2243C1
P 8300 1950
F 0 "D26" H 8300 2267 50  0000 C CNN
F 1 "SMD-RGB-HI-LIGHT(6P-L5.0*W5.0*H1.5MM)" H 8300 2176 50  0000 C CNN
F 2 "LED_SMD:LED_RGB_5050-6" H 8300 1950 50  0001 L BNN
F 3 "Chengguangxing" H 8300 1950 50  0001 L BNN
F 4 "None" H 8300 1950 50  0001 L BNN "Feld4"
F 5 "SMD RGB Hi-Light" H 8300 1950 50  0001 L BNN "Feld5"
F 6 "5050RGB" H 8300 1950 50  0001 L BNN "Feld6"
F 7 "None" H 8300 1950 50  0001 L BNN "Feld7"
F 8 "Unavailable" H 8300 1950 50  0001 L BNN "Feld8"
	1    8300 1950
	1    0    0    -1  
$EndComp
$Comp
L LED_5050_RGB:SMD-RGB-HI-LIGHT(6P-L5.0*W5.0*H1.5MM) D33
U 1 1 5C224617
P 9300 2950
F 0 "D33" H 9300 3267 50  0000 C CNN
F 1 "SMD-RGB-HI-LIGHT(6P-L5.0*W5.0*H1.5MM)" H 9300 3176 50  0000 C CNN
F 2 "LED_SMD:LED_RGB_5050-6" H 9300 2950 50  0001 L BNN
F 3 "Chengguangxing" H 9300 2950 50  0001 L BNN
F 4 "None" H 9300 2950 50  0001 L BNN "Feld4"
F 5 "SMD RGB Hi-Light" H 9300 2950 50  0001 L BNN "Feld5"
F 6 "5050RGB" H 9300 2950 50  0001 L BNN "Feld6"
F 7 "None" H 9300 2950 50  0001 L BNN "Feld7"
F 8 "Unavailable" H 9300 2950 50  0001 L BNN "Feld8"
	1    9300 2950
	1    0    0    -1  
$EndComp
$Comp
L LED_5050_RGB:SMD-RGB-HI-LIGHT(6P-L5.0*W5.0*H1.5MM) D32
U 1 1 5C224655
P 9300 2450
F 0 "D32" H 9300 2767 50  0000 C CNN
F 1 "SMD-RGB-HI-LIGHT(6P-L5.0*W5.0*H1.5MM)" H 9300 2676 50  0000 C CNN
F 2 "LED_SMD:LED_RGB_5050-6" H 9300 2450 50  0001 L BNN
F 3 "Chengguangxing" H 9300 2450 50  0001 L BNN
F 4 "None" H 9300 2450 50  0001 L BNN "Feld4"
F 5 "SMD RGB Hi-Light" H 9300 2450 50  0001 L BNN "Feld5"
F 6 "5050RGB" H 9300 2450 50  0001 L BNN "Feld6"
F 7 "None" H 9300 2450 50  0001 L BNN "Feld7"
F 8 "Unavailable" H 9300 2450 50  0001 L BNN "Feld8"
	1    9300 2450
	1    0    0    -1  
$EndComp
$Comp
L LED_5050_RGB:SMD-RGB-HI-LIGHT(6P-L5.0*W5.0*H1.5MM) D31
U 1 1 5C22468F
P 9300 1950
F 0 "D31" H 9300 2267 50  0000 C CNN
F 1 "SMD-RGB-HI-LIGHT(6P-L5.0*W5.0*H1.5MM)" H 9300 2176 50  0000 C CNN
F 2 "LED_SMD:LED_RGB_5050-6" H 9300 1950 50  0001 L BNN
F 3 "Chengguangxing" H 9300 1950 50  0001 L BNN
F 4 "None" H 9300 1950 50  0001 L BNN "Feld4"
F 5 "SMD RGB Hi-Light" H 9300 1950 50  0001 L BNN "Feld5"
F 6 "5050RGB" H 9300 1950 50  0001 L BNN "Feld6"
F 7 "None" H 9300 1950 50  0001 L BNN "Feld7"
F 8 "Unavailable" H 9300 1950 50  0001 L BNN "Feld8"
	1    9300 1950
	1    0    0    -1  
$EndComp
$Comp
L LED_5050_RGB:SMD-RGB-HI-LIGHT(6P-L5.0*W5.0*H1.5MM) D20
U 1 1 5C224FC4
P 7300 1450
F 0 "D20" H 7300 1767 50  0000 C CNN
F 1 "SMD-RGB-HI-LIGHT(6P-L5.0*W5.0*H1.5MM)" H 7300 1676 50  0000 C CNN
F 2 "LED_SMD:LED_RGB_5050-6" H 7300 1450 50  0001 L BNN
F 3 "Chengguangxing" H 7300 1450 50  0001 L BNN
F 4 "None" H 7300 1450 50  0001 L BNN "Feld4"
F 5 "SMD RGB Hi-Light" H 7300 1450 50  0001 L BNN "Feld5"
F 6 "5050RGB" H 7300 1450 50  0001 L BNN "Feld6"
F 7 "None" H 7300 1450 50  0001 L BNN "Feld7"
F 8 "Unavailable" H 7300 1450 50  0001 L BNN "Feld8"
	1    7300 1450
	1    0    0    -1  
$EndComp
$Comp
L LED_5050_RGB:SMD-RGB-HI-LIGHT(6P-L5.0*W5.0*H1.5MM) D25
U 1 1 5C225058
P 8300 1450
F 0 "D25" H 8300 1767 50  0000 C CNN
F 1 "SMD-RGB-HI-LIGHT(6P-L5.0*W5.0*H1.5MM)" H 8300 1676 50  0000 C CNN
F 2 "LED_SMD:LED_RGB_5050-6" H 8300 1450 50  0001 L BNN
F 3 "Chengguangxing" H 8300 1450 50  0001 L BNN
F 4 "None" H 8300 1450 50  0001 L BNN "Feld4"
F 5 "SMD RGB Hi-Light" H 8300 1450 50  0001 L BNN "Feld5"
F 6 "5050RGB" H 8300 1450 50  0001 L BNN "Feld6"
F 7 "None" H 8300 1450 50  0001 L BNN "Feld7"
F 8 "Unavailable" H 8300 1450 50  0001 L BNN "Feld8"
	1    8300 1450
	1    0    0    -1  
$EndComp
$Comp
L LED_5050_RGB:SMD-RGB-HI-LIGHT(6P-L5.0*W5.0*H1.5MM) D30
U 1 1 5C225094
P 9300 1450
F 0 "D30" H 9300 1767 50  0000 C CNN
F 1 "SMD-RGB-HI-LIGHT(6P-L5.0*W5.0*H1.5MM)" H 9300 1676 50  0000 C CNN
F 2 "LED_SMD:LED_RGB_5050-6" H 9300 1450 50  0001 L BNN
F 3 "Chengguangxing" H 9300 1450 50  0001 L BNN
F 4 "None" H 9300 1450 50  0001 L BNN "Feld4"
F 5 "SMD RGB Hi-Light" H 9300 1450 50  0001 L BNN "Feld5"
F 6 "5050RGB" H 9300 1450 50  0001 L BNN "Feld6"
F 7 "None" H 9300 1450 50  0001 L BNN "Feld7"
F 8 "Unavailable" H 9300 1450 50  0001 L BNN "Feld8"
	1    9300 1450
	1    0    0    -1  
$EndComp
$Comp
L LED_5050_RGB:SMD-RGB-HI-LIGHT(6P-L5.0*W5.0*H1.5MM) D19
U 1 1 5C2250D5
P 7300 950
F 0 "D19" H 7300 1267 50  0000 C CNN
F 1 "SMD-RGB-HI-LIGHT(6P-L5.0*W5.0*H1.5MM)" H 7300 1176 50  0000 C CNN
F 2 "LED_SMD:LED_RGB_5050-6" H 7300 950 50  0001 L BNN
F 3 "Chengguangxing" H 7300 950 50  0001 L BNN
F 4 "None" H 7300 950 50  0001 L BNN "Feld4"
F 5 "SMD RGB Hi-Light" H 7300 950 50  0001 L BNN "Feld5"
F 6 "5050RGB" H 7300 950 50  0001 L BNN "Feld6"
F 7 "None" H 7300 950 50  0001 L BNN "Feld7"
F 8 "Unavailable" H 7300 950 50  0001 L BNN "Feld8"
	1    7300 950 
	1    0    0    -1  
$EndComp
$Comp
L LED_5050_RGB:SMD-RGB-HI-LIGHT(6P-L5.0*W5.0*H1.5MM) D24
U 1 1 5C22510F
P 8300 950
F 0 "D24" H 8300 1267 50  0000 C CNN
F 1 "SMD-RGB-HI-LIGHT(6P-L5.0*W5.0*H1.5MM)" H 8300 1176 50  0000 C CNN
F 2 "LED_SMD:LED_RGB_5050-6" H 8300 950 50  0001 L BNN
F 3 "Chengguangxing" H 8300 950 50  0001 L BNN
F 4 "None" H 8300 950 50  0001 L BNN "Feld4"
F 5 "SMD RGB Hi-Light" H 8300 950 50  0001 L BNN "Feld5"
F 6 "5050RGB" H 8300 950 50  0001 L BNN "Feld6"
F 7 "None" H 8300 950 50  0001 L BNN "Feld7"
F 8 "Unavailable" H 8300 950 50  0001 L BNN "Feld8"
	1    8300 950 
	1    0    0    -1  
$EndComp
$Comp
L LED_5050_RGB:SMD-RGB-HI-LIGHT(6P-L5.0*W5.0*H1.5MM) D29
U 1 1 5C225156
P 9300 950
F 0 "D29" H 9300 1267 50  0000 C CNN
F 1 "SMD-RGB-HI-LIGHT(6P-L5.0*W5.0*H1.5MM)" H 9300 1176 50  0000 C CNN
F 2 "LED_SMD:LED_RGB_5050-6" H 9300 950 50  0001 L BNN
F 3 "Chengguangxing" H 9300 950 50  0001 L BNN
F 4 "None" H 9300 950 50  0001 L BNN "Feld4"
F 5 "SMD RGB Hi-Light" H 9300 950 50  0001 L BNN "Feld5"
F 6 "5050RGB" H 9300 950 50  0001 L BNN "Feld6"
F 7 "None" H 9300 950 50  0001 L BNN "Feld7"
F 8 "Unavailable" H 9300 950 50  0001 L BNN "Feld8"
	1    9300 950 
	1    0    0    -1  
$EndComp
Wire Wire Line
	6700 950  6700 850 
Wire Wire Line
	6700 850  6800 850 
Connection ~ 6700 950 
Wire Wire Line
	6700 950  6800 950 
Wire Wire Line
	6700 950  6700 1050
Wire Wire Line
	6700 1050 6800 1050
Wire Wire Line
	9800 850  10400 850 
Wire Wire Line
	11000 850  11000 1350
Wire Wire Line
	9800 950  10250 950 
Wire Wire Line
	10900 950  10900 1450
Wire Wire Line
	9800 1050 10100 1050
Wire Wire Line
	10800 1050 10800 1550
Wire Wire Line
	6800 1350 6700 1350
Wire Wire Line
	6700 1350 6700 1450
Connection ~ 6700 1450
Wire Wire Line
	6700 1450 6800 1450
Wire Wire Line
	6800 1550 6700 1550
Wire Wire Line
	6700 1550 6700 1450
Wire Wire Line
	6800 1850 6700 1850
Wire Wire Line
	6700 1850 6700 1950
Wire Wire Line
	6700 2050 6800 2050
Wire Wire Line
	6800 1950 6700 1950
Connection ~ 6700 1950
Wire Wire Line
	6700 1950 6700 2050
Wire Wire Line
	6800 2350 6700 2350
Wire Wire Line
	6700 2350 6700 2450
Wire Wire Line
	6700 2450 6800 2450
Wire Wire Line
	6800 2550 6700 2550
Wire Wire Line
	6700 2550 6700 2450
Connection ~ 6700 2450
Wire Wire Line
	6800 2850 6700 2850
Wire Wire Line
	6700 2850 6700 2950
Connection ~ 6700 2950
Wire Wire Line
	6700 2950 6800 2950
Wire Wire Line
	6800 3050 6700 3050
Wire Wire Line
	6700 3050 6700 2950
Wire Wire Line
	9800 1350 10400 1350
Connection ~ 11000 1350
Wire Wire Line
	11000 1350 11000 1850
Wire Wire Line
	9800 1850 10400 1850
Connection ~ 11000 1850
Wire Wire Line
	11000 1850 11000 2350
Wire Wire Line
	9800 2350 10400 2350
Connection ~ 11000 2350
Wire Wire Line
	9800 2850 10400 2850
Connection ~ 11000 2850
Wire Wire Line
	9800 1450 10250 1450
Connection ~ 10900 1450
Wire Wire Line
	10900 1450 10900 1950
Wire Wire Line
	9800 1950 10250 1950
Connection ~ 10900 1950
Wire Wire Line
	10900 1950 10900 2450
Wire Wire Line
	9800 2450 10250 2450
Connection ~ 10900 2450
Wire Wire Line
	10900 2450 10900 2950
Wire Wire Line
	9800 2950 10250 2950
Connection ~ 10900 2950
Wire Wire Line
	9800 1550 10100 1550
Connection ~ 10800 1550
Wire Wire Line
	10800 1550 10800 2050
Connection ~ 10800 2050
Wire Wire Line
	9800 2550 10100 2550
Wire Wire Line
	10800 2050 10800 2550
Connection ~ 10800 2550
Wire Wire Line
	9800 3050 10050 3050
Wire Wire Line
	6300 950  6700 950 
Wire Wire Line
	6300 950  6300 1450
Wire Wire Line
	6300 1450 6700 1450
Connection ~ 6300 1450
Wire Wire Line
	6300 1450 6300 1950
Wire Wire Line
	6300 1950 6700 1950
Connection ~ 6300 1950
Wire Wire Line
	6300 1950 6300 2450
Wire Wire Line
	6300 2450 6700 2450
Connection ~ 6300 2450
Wire Wire Line
	6300 2450 6300 2950
Wire Wire Line
	6300 2950 6700 2950
Connection ~ 6300 2950
Text Label 11000 3600 0    50   ~ 0
G
$Comp
L Device:R R23
U 1 1 5C232D05
P 10200 3050
F 0 "R23" V 9993 3050 50  0000 C CNN
F 1 "130" V 10084 3050 50  0000 C CNN
F 2 "Resistor_SMD:R_0805_2012Metric_Pad1.15x1.40mm_HandSolder" V 10130 3050 50  0001 C CNN
F 3 "~" H 10200 3050 50  0001 C CNN
	1    10200 3050
	0    1    1    0   
$EndComp
$Comp
L Device:R R28
U 1 1 5C232D5F
P 10400 2950
F 0 "R28" V 10193 2950 50  0000 C CNN
F 1 "300" V 10284 2950 50  0000 C CNN
F 2 "Resistor_SMD:R_0805_2012Metric_Pad1.15x1.40mm_HandSolder" V 10330 2950 50  0001 C CNN
F 3 "~" H 10400 2950 50  0001 C CNN
	1    10400 2950
	0    1    1    0   
$EndComp
Wire Wire Line
	10550 2950 10900 2950
$Comp
L Device:R R33
U 1 1 5C232D9F
P 10550 2850
F 0 "R33" V 10343 2850 50  0000 C CNN
F 1 "130" V 10434 2850 50  0000 C CNN
F 2 "Resistor_SMD:R_0805_2012Metric_Pad1.15x1.40mm_HandSolder" V 10480 2850 50  0001 C CNN
F 3 "~" H 10550 2850 50  0001 C CNN
	1    10550 2850
	0    1    1    0   
$EndComp
Wire Wire Line
	10700 2850 11000 2850
$Comp
L Device:R R32
U 1 1 5C23416D
P 10550 2350
F 0 "R32" V 10343 2350 50  0000 C CNN
F 1 "130" V 10434 2350 50  0000 C CNN
F 2 "Resistor_SMD:R_0805_2012Metric_Pad1.15x1.40mm_HandSolder" V 10480 2350 50  0001 C CNN
F 3 "~" H 10550 2350 50  0001 C CNN
	1    10550 2350
	0    1    1    0   
$EndComp
Wire Wire Line
	10700 2350 11000 2350
$Comp
L Device:R R27
U 1 1 5C2341AF
P 10400 2450
F 0 "R27" V 10193 2450 50  0000 C CNN
F 1 "300" V 10284 2450 50  0000 C CNN
F 2 "Resistor_SMD:R_0805_2012Metric_Pad1.15x1.40mm_HandSolder" V 10330 2450 50  0001 C CNN
F 3 "~" H 10400 2450 50  0001 C CNN
	1    10400 2450
	0    1    1    0   
$EndComp
Wire Wire Line
	10550 2450 10900 2450
$Comp
L Device:R R22
U 1 1 5C2341F1
P 10250 2550
F 0 "R22" V 10043 2550 50  0000 C CNN
F 1 "130" V 10134 2550 50  0000 C CNN
F 2 "Resistor_SMD:R_0805_2012Metric_Pad1.15x1.40mm_HandSolder" V 10180 2550 50  0001 C CNN
F 3 "~" H 10250 2550 50  0001 C CNN
	1    10250 2550
	0    1    1    0   
$EndComp
Wire Wire Line
	10400 2550 10800 2550
$Comp
L Device:R R26
U 1 1 5C234330
P 10400 1950
F 0 "R26" V 10193 1950 50  0000 C CNN
F 1 "300" V 10284 1950 50  0000 C CNN
F 2 "Resistor_SMD:R_0805_2012Metric_Pad1.15x1.40mm_HandSolder" V 10330 1950 50  0001 C CNN
F 3 "~" H 10400 1950 50  0001 C CNN
	1    10400 1950
	0    1    1    0   
$EndComp
Wire Wire Line
	10550 1950 10900 1950
$Comp
L Device:R R31
U 1 1 5C234378
P 10550 1850
F 0 "R31" V 10343 1850 50  0000 C CNN
F 1 "130" V 10434 1850 50  0000 C CNN
F 2 "Resistor_SMD:R_0805_2012Metric_Pad1.15x1.40mm_HandSolder" V 10480 1850 50  0001 C CNN
F 3 "~" H 10550 1850 50  0001 C CNN
	1    10550 1850
	0    1    1    0   
$EndComp
Wire Wire Line
	10700 1850 11000 1850
$Comp
L Device:R R30
U 1 1 5C2343BC
P 10550 1350
F 0 "R30" V 10343 1350 50  0000 C CNN
F 1 "130" V 10434 1350 50  0000 C CNN
F 2 "Resistor_SMD:R_0805_2012Metric_Pad1.15x1.40mm_HandSolder" V 10480 1350 50  0001 C CNN
F 3 "~" H 10550 1350 50  0001 C CNN
	1    10550 1350
	0    1    1    0   
$EndComp
Wire Wire Line
	10700 1350 11000 1350
Wire Wire Line
	9800 2050 10100 2050
$Comp
L Device:R R21
U 1 1 5C2389F4
P 10250 2050
F 0 "R21" V 10043 2050 50  0000 C CNN
F 1 "130" V 10134 2050 50  0000 C CNN
F 2 "Resistor_SMD:R_0805_2012Metric_Pad1.15x1.40mm_HandSolder" V 10180 2050 50  0001 C CNN
F 3 "~" H 10250 2050 50  0001 C CNN
	1    10250 2050
	0    1    1    0   
$EndComp
Wire Wire Line
	10400 2050 10800 2050
$Comp
L Device:R R25
U 1 1 5C238A41
P 10400 1450
F 0 "R25" V 10193 1450 50  0000 C CNN
F 1 "300" V 10284 1450 50  0000 C CNN
F 2 "Resistor_SMD:R_0805_2012Metric_Pad1.15x1.40mm_HandSolder" V 10330 1450 50  0001 C CNN
F 3 "~" H 10400 1450 50  0001 C CNN
	1    10400 1450
	0    1    1    0   
$EndComp
Wire Wire Line
	10550 1450 10900 1450
$Comp
L Device:R R20
U 1 1 5C238A8E
P 10250 1550
F 0 "R20" V 10043 1550 50  0000 C CNN
F 1 "130" V 10134 1550 50  0000 C CNN
F 2 "Resistor_SMD:R_0805_2012Metric_Pad1.15x1.40mm_HandSolder" V 10180 1550 50  0001 C CNN
F 3 "~" H 10250 1550 50  0001 C CNN
	1    10250 1550
	0    1    1    0   
$EndComp
Wire Wire Line
	10400 1550 10800 1550
$Comp
L Device:R R29
U 1 1 5C238B9C
P 10550 850
F 0 "R29" V 10343 850 50  0000 C CNN
F 1 "130" V 10434 850 50  0000 C CNN
F 2 "Resistor_SMD:R_0805_2012Metric_Pad1.15x1.40mm_HandSolder" V 10480 850 50  0001 C CNN
F 3 "~" H 10550 850 50  0001 C CNN
	1    10550 850 
	0    1    1    0   
$EndComp
Wire Wire Line
	10700 850  11000 850 
$Comp
L Device:R R24
U 1 1 5C238BF0
P 10400 950
F 0 "R24" V 10193 950 50  0000 C CNN
F 1 "300" V 10284 950 50  0000 C CNN
F 2 "Resistor_SMD:R_0805_2012Metric_Pad1.15x1.40mm_HandSolder" V 10330 950 50  0001 C CNN
F 3 "~" H 10400 950 50  0001 C CNN
	1    10400 950 
	0    1    1    0   
$EndComp
Wire Wire Line
	10550 950  10900 950 
$Comp
L Device:R R19
U 1 1 5C238C46
P 10250 1050
F 0 "R19" V 10043 1050 50  0000 C CNN
F 1 "130" V 10134 1050 50  0000 C CNN
F 2 "Resistor_SMD:R_0805_2012Metric_Pad1.15x1.40mm_HandSolder" V 10180 1050 50  0001 C CNN
F 3 "~" H 10250 1050 50  0001 C CNN
	1    10250 1050
	0    1    1    0   
$EndComp
Wire Wire Line
	10400 1050 10800 1050
Wire Wire Line
	11000 2350 11000 2850
$Comp
L LED_5050_RGB:SMD-RGB-HI-LIGHT(6P-L5.0*W5.0*H1.5MM) D1
U 1 1 5C242EDD
P 1850 850
F 0 "D1" H 1850 1167 50  0000 C CNN
F 1 "SMD-RGB-HI-LIGHT(6P-L5.0*W5.0*H1.5MM)" H 1850 1076 50  0000 C CNN
F 2 "LED_SMD:LED_RGB_5050-6" H 1850 850 50  0001 L BNN
F 3 "Chengguangxing" H 1850 850 50  0001 L BNN
F 4 "None" H 1850 850 50  0001 L BNN "Feld4"
F 5 "SMD RGB Hi-Light" H 1850 850 50  0001 L BNN "Feld5"
F 6 "5050RGB" H 1850 850 50  0001 L BNN "Feld6"
F 7 "None" H 1850 850 50  0001 L BNN "Feld7"
F 8 "Unavailable" H 1850 850 50  0001 L BNN "Feld8"
	1    1850 850 
	1    0    0    -1  
$EndComp
$Comp
L LED_5050_RGB:SMD-RGB-HI-LIGHT(6P-L5.0*W5.0*H1.5MM) D7
U 1 1 5C24313C
P 2850 850
F 0 "D7" H 2850 1167 50  0000 C CNN
F 1 "SMD-RGB-HI-LIGHT(6P-L5.0*W5.0*H1.5MM)" H 2850 1076 50  0000 C CNN
F 2 "LED_SMD:LED_RGB_5050-6" H 2850 850 50  0001 L BNN
F 3 "Chengguangxing" H 2850 850 50  0001 L BNN
F 4 "None" H 2850 850 50  0001 L BNN "Feld4"
F 5 "SMD RGB Hi-Light" H 2850 850 50  0001 L BNN "Feld5"
F 6 "5050RGB" H 2850 850 50  0001 L BNN "Feld6"
F 7 "None" H 2850 850 50  0001 L BNN "Feld7"
F 8 "Unavailable" H 2850 850 50  0001 L BNN "Feld8"
	1    2850 850 
	1    0    0    -1  
$EndComp
$Comp
L LED_5050_RGB:SMD-RGB-HI-LIGHT(6P-L5.0*W5.0*H1.5MM) D13
U 1 1 5C2431A1
P 3850 850
F 0 "D13" H 3850 1167 50  0000 C CNN
F 1 "SMD-RGB-HI-LIGHT(6P-L5.0*W5.0*H1.5MM)" H 3850 1076 50  0000 C CNN
F 2 "LED_SMD:LED_RGB_5050-6" H 3850 850 50  0001 L BNN
F 3 "Chengguangxing" H 3850 850 50  0001 L BNN
F 4 "None" H 3850 850 50  0001 L BNN "Feld4"
F 5 "SMD RGB Hi-Light" H 3850 850 50  0001 L BNN "Feld5"
F 6 "5050RGB" H 3850 850 50  0001 L BNN "Feld6"
F 7 "None" H 3850 850 50  0001 L BNN "Feld7"
F 8 "Unavailable" H 3850 850 50  0001 L BNN "Feld8"
	1    3850 850 
	1    0    0    -1  
$EndComp
$Comp
L LED_5050_RGB:SMD-RGB-HI-LIGHT(6P-L5.0*W5.0*H1.5MM) D2
U 1 1 5C24320D
P 1850 1350
F 0 "D2" H 1850 1667 50  0000 C CNN
F 1 "SMD-RGB-HI-LIGHT(6P-L5.0*W5.0*H1.5MM)" H 1850 1576 50  0000 C CNN
F 2 "LED_SMD:LED_RGB_5050-6" H 1850 1350 50  0001 L BNN
F 3 "Chengguangxing" H 1850 1350 50  0001 L BNN
F 4 "None" H 1850 1350 50  0001 L BNN "Feld4"
F 5 "SMD RGB Hi-Light" H 1850 1350 50  0001 L BNN "Feld5"
F 6 "5050RGB" H 1850 1350 50  0001 L BNN "Feld6"
F 7 "None" H 1850 1350 50  0001 L BNN "Feld7"
F 8 "Unavailable" H 1850 1350 50  0001 L BNN "Feld8"
	1    1850 1350
	1    0    0    -1  
$EndComp
$Comp
L LED_5050_RGB:SMD-RGB-HI-LIGHT(6P-L5.0*W5.0*H1.5MM) D8
U 1 1 5C243278
P 2850 1350
F 0 "D8" H 2850 1667 50  0000 C CNN
F 1 "SMD-RGB-HI-LIGHT(6P-L5.0*W5.0*H1.5MM)" H 2850 1576 50  0000 C CNN
F 2 "LED_SMD:LED_RGB_5050-6" H 2850 1350 50  0001 L BNN
F 3 "Chengguangxing" H 2850 1350 50  0001 L BNN
F 4 "None" H 2850 1350 50  0001 L BNN "Feld4"
F 5 "SMD RGB Hi-Light" H 2850 1350 50  0001 L BNN "Feld5"
F 6 "5050RGB" H 2850 1350 50  0001 L BNN "Feld6"
F 7 "None" H 2850 1350 50  0001 L BNN "Feld7"
F 8 "Unavailable" H 2850 1350 50  0001 L BNN "Feld8"
	1    2850 1350
	1    0    0    -1  
$EndComp
$Comp
L LED_5050_RGB:SMD-RGB-HI-LIGHT(6P-L5.0*W5.0*H1.5MM) D14
U 1 1 5C2432E4
P 3850 1350
F 0 "D14" H 3850 1667 50  0000 C CNN
F 1 "SMD-RGB-HI-LIGHT(6P-L5.0*W5.0*H1.5MM)" H 3850 1576 50  0000 C CNN
F 2 "LED_SMD:LED_RGB_5050-6" H 3850 1350 50  0001 L BNN
F 3 "Chengguangxing" H 3850 1350 50  0001 L BNN
F 4 "None" H 3850 1350 50  0001 L BNN "Feld4"
F 5 "SMD RGB Hi-Light" H 3850 1350 50  0001 L BNN "Feld5"
F 6 "5050RGB" H 3850 1350 50  0001 L BNN "Feld6"
F 7 "None" H 3850 1350 50  0001 L BNN "Feld7"
F 8 "Unavailable" H 3850 1350 50  0001 L BNN "Feld8"
	1    3850 1350
	1    0    0    -1  
$EndComp
$Comp
L LED_5050_RGB:SMD-RGB-HI-LIGHT(6P-L5.0*W5.0*H1.5MM) D15
U 1 1 5C24335C
P 3850 1850
F 0 "D15" H 3850 2167 50  0000 C CNN
F 1 "SMD-RGB-HI-LIGHT(6P-L5.0*W5.0*H1.5MM)" H 3850 2076 50  0000 C CNN
F 2 "LED_SMD:LED_RGB_5050-6" H 3850 1850 50  0001 L BNN
F 3 "Chengguangxing" H 3850 1850 50  0001 L BNN
F 4 "None" H 3850 1850 50  0001 L BNN "Feld4"
F 5 "SMD RGB Hi-Light" H 3850 1850 50  0001 L BNN "Feld5"
F 6 "5050RGB" H 3850 1850 50  0001 L BNN "Feld6"
F 7 "None" H 3850 1850 50  0001 L BNN "Feld7"
F 8 "Unavailable" H 3850 1850 50  0001 L BNN "Feld8"
	1    3850 1850
	1    0    0    -1  
$EndComp
$Comp
L LED_5050_RGB:SMD-RGB-HI-LIGHT(6P-L5.0*W5.0*H1.5MM) D9
U 1 1 5C2433C7
P 2850 1850
F 0 "D9" H 2850 2167 50  0000 C CNN
F 1 "SMD-RGB-HI-LIGHT(6P-L5.0*W5.0*H1.5MM)" H 2850 2076 50  0000 C CNN
F 2 "LED_SMD:LED_RGB_5050-6" H 2850 1850 50  0001 L BNN
F 3 "Chengguangxing" H 2850 1850 50  0001 L BNN
F 4 "None" H 2850 1850 50  0001 L BNN "Feld4"
F 5 "SMD RGB Hi-Light" H 2850 1850 50  0001 L BNN "Feld5"
F 6 "5050RGB" H 2850 1850 50  0001 L BNN "Feld6"
F 7 "None" H 2850 1850 50  0001 L BNN "Feld7"
F 8 "Unavailable" H 2850 1850 50  0001 L BNN "Feld8"
	1    2850 1850
	1    0    0    -1  
$EndComp
$Comp
L LED_5050_RGB:SMD-RGB-HI-LIGHT(6P-L5.0*W5.0*H1.5MM) D3
U 1 1 5C24343A
P 1850 1850
F 0 "D3" H 1850 2167 50  0000 C CNN
F 1 "SMD-RGB-HI-LIGHT(6P-L5.0*W5.0*H1.5MM)" H 1850 2076 50  0000 C CNN
F 2 "LED_SMD:LED_RGB_5050-6" H 1850 1850 50  0001 L BNN
F 3 "Chengguangxing" H 1850 1850 50  0001 L BNN
F 4 "None" H 1850 1850 50  0001 L BNN "Feld4"
F 5 "SMD RGB Hi-Light" H 1850 1850 50  0001 L BNN "Feld5"
F 6 "5050RGB" H 1850 1850 50  0001 L BNN "Feld6"
F 7 "None" H 1850 1850 50  0001 L BNN "Feld7"
F 8 "Unavailable" H 1850 1850 50  0001 L BNN "Feld8"
	1    1850 1850
	1    0    0    -1  
$EndComp
$Comp
L LED_5050_RGB:SMD-RGB-HI-LIGHT(6P-L5.0*W5.0*H1.5MM) D4
U 1 1 5C2434B2
P 1850 2350
F 0 "D4" H 1850 2667 50  0000 C CNN
F 1 "SMD-RGB-HI-LIGHT(6P-L5.0*W5.0*H1.5MM)" H 1850 2576 50  0000 C CNN
F 2 "LED_SMD:LED_RGB_5050-6" H 1850 2350 50  0001 L BNN
F 3 "Chengguangxing" H 1850 2350 50  0001 L BNN
F 4 "None" H 1850 2350 50  0001 L BNN "Feld4"
F 5 "SMD RGB Hi-Light" H 1850 2350 50  0001 L BNN "Feld5"
F 6 "5050RGB" H 1850 2350 50  0001 L BNN "Feld6"
F 7 "None" H 1850 2350 50  0001 L BNN "Feld7"
F 8 "Unavailable" H 1850 2350 50  0001 L BNN "Feld8"
	1    1850 2350
	1    0    0    -1  
$EndComp
$Comp
L LED_5050_RGB:SMD-RGB-HI-LIGHT(6P-L5.0*W5.0*H1.5MM) D10
U 1 1 5C243522
P 2850 2350
F 0 "D10" H 2850 2667 50  0000 C CNN
F 1 "SMD-RGB-HI-LIGHT(6P-L5.0*W5.0*H1.5MM)" H 2850 2576 50  0000 C CNN
F 2 "LED_SMD:LED_RGB_5050-6" H 2850 2350 50  0001 L BNN
F 3 "Chengguangxing" H 2850 2350 50  0001 L BNN
F 4 "None" H 2850 2350 50  0001 L BNN "Feld4"
F 5 "SMD RGB Hi-Light" H 2850 2350 50  0001 L BNN "Feld5"
F 6 "5050RGB" H 2850 2350 50  0001 L BNN "Feld6"
F 7 "None" H 2850 2350 50  0001 L BNN "Feld7"
F 8 "Unavailable" H 2850 2350 50  0001 L BNN "Feld8"
	1    2850 2350
	1    0    0    -1  
$EndComp
$Comp
L LED_5050_RGB:SMD-RGB-HI-LIGHT(6P-L5.0*W5.0*H1.5MM) D16
U 1 1 5C24359A
P 3850 2350
F 0 "D16" H 3850 2667 50  0000 C CNN
F 1 "SMD-RGB-HI-LIGHT(6P-L5.0*W5.0*H1.5MM)" H 3850 2576 50  0000 C CNN
F 2 "LED_SMD:LED_RGB_5050-6" H 3850 2350 50  0001 L BNN
F 3 "Chengguangxing" H 3850 2350 50  0001 L BNN
F 4 "None" H 3850 2350 50  0001 L BNN "Feld4"
F 5 "SMD RGB Hi-Light" H 3850 2350 50  0001 L BNN "Feld5"
F 6 "5050RGB" H 3850 2350 50  0001 L BNN "Feld6"
F 7 "None" H 3850 2350 50  0001 L BNN "Feld7"
F 8 "Unavailable" H 3850 2350 50  0001 L BNN "Feld8"
	1    3850 2350
	1    0    0    -1  
$EndComp
$Comp
L LED_5050_RGB:SMD-RGB-HI-LIGHT(6P-L5.0*W5.0*H1.5MM) D17
U 1 1 5C24362F
P 3850 2850
F 0 "D17" H 3850 3167 50  0000 C CNN
F 1 "SMD-RGB-HI-LIGHT(6P-L5.0*W5.0*H1.5MM)" H 3850 3076 50  0000 C CNN
F 2 "LED_SMD:LED_RGB_5050-6" H 3850 2850 50  0001 L BNN
F 3 "Chengguangxing" H 3850 2850 50  0001 L BNN
F 4 "None" H 3850 2850 50  0001 L BNN "Feld4"
F 5 "SMD RGB Hi-Light" H 3850 2850 50  0001 L BNN "Feld5"
F 6 "5050RGB" H 3850 2850 50  0001 L BNN "Feld6"
F 7 "None" H 3850 2850 50  0001 L BNN "Feld7"
F 8 "Unavailable" H 3850 2850 50  0001 L BNN "Feld8"
	1    3850 2850
	1    0    0    -1  
$EndComp
$Comp
L LED_5050_RGB:SMD-RGB-HI-LIGHT(6P-L5.0*W5.0*H1.5MM) D11
U 1 1 5C2436AF
P 2850 2850
F 0 "D11" H 2850 3167 50  0000 C CNN
F 1 "SMD-RGB-HI-LIGHT(6P-L5.0*W5.0*H1.5MM)" H 2850 3076 50  0000 C CNN
F 2 "LED_SMD:LED_RGB_5050-6" H 2850 2850 50  0001 L BNN
F 3 "Chengguangxing" H 2850 2850 50  0001 L BNN
F 4 "None" H 2850 2850 50  0001 L BNN "Feld4"
F 5 "SMD RGB Hi-Light" H 2850 2850 50  0001 L BNN "Feld5"
F 6 "5050RGB" H 2850 2850 50  0001 L BNN "Feld6"
F 7 "None" H 2850 2850 50  0001 L BNN "Feld7"
F 8 "Unavailable" H 2850 2850 50  0001 L BNN "Feld8"
	1    2850 2850
	1    0    0    -1  
$EndComp
$Comp
L LED_5050_RGB:SMD-RGB-HI-LIGHT(6P-L5.0*W5.0*H1.5MM) D5
U 1 1 5C243732
P 1850 2850
F 0 "D5" H 1850 3167 50  0000 C CNN
F 1 "SMD-RGB-HI-LIGHT(6P-L5.0*W5.0*H1.5MM)" H 1850 3076 50  0000 C CNN
F 2 "LED_SMD:LED_RGB_5050-6" H 1850 2850 50  0001 L BNN
F 3 "Chengguangxing" H 1850 2850 50  0001 L BNN
F 4 "None" H 1850 2850 50  0001 L BNN "Feld4"
F 5 "SMD RGB Hi-Light" H 1850 2850 50  0001 L BNN "Feld5"
F 6 "5050RGB" H 1850 2850 50  0001 L BNN "Feld6"
F 7 "None" H 1850 2850 50  0001 L BNN "Feld7"
F 8 "Unavailable" H 1850 2850 50  0001 L BNN "Feld8"
	1    1850 2850
	1    0    0    -1  
$EndComp
$Comp
L LED_5050_RGB:SMD-RGB-HI-LIGHT(6P-L5.0*W5.0*H1.5MM) D6
U 1 1 5C2437B3
P 1850 3350
F 0 "D6" H 1850 3667 50  0000 C CNN
F 1 "SMD-RGB-HI-LIGHT(6P-L5.0*W5.0*H1.5MM)" H 1850 3576 50  0000 C CNN
F 2 "LED_SMD:LED_RGB_5050-6" H 1850 3350 50  0001 L BNN
F 3 "Chengguangxing" H 1850 3350 50  0001 L BNN
F 4 "None" H 1850 3350 50  0001 L BNN "Feld4"
F 5 "SMD RGB Hi-Light" H 1850 3350 50  0001 L BNN "Feld5"
F 6 "5050RGB" H 1850 3350 50  0001 L BNN "Feld6"
F 7 "None" H 1850 3350 50  0001 L BNN "Feld7"
F 8 "Unavailable" H 1850 3350 50  0001 L BNN "Feld8"
	1    1850 3350
	1    0    0    -1  
$EndComp
$Comp
L LED_5050_RGB:SMD-RGB-HI-LIGHT(6P-L5.0*W5.0*H1.5MM) D12
U 1 1 5C243839
P 2850 3350
F 0 "D12" H 2850 3667 50  0000 C CNN
F 1 "SMD-RGB-HI-LIGHT(6P-L5.0*W5.0*H1.5MM)" H 2850 3576 50  0000 C CNN
F 2 "LED_SMD:LED_RGB_5050-6" H 2850 3350 50  0001 L BNN
F 3 "Chengguangxing" H 2850 3350 50  0001 L BNN
F 4 "None" H 2850 3350 50  0001 L BNN "Feld4"
F 5 "SMD RGB Hi-Light" H 2850 3350 50  0001 L BNN "Feld5"
F 6 "5050RGB" H 2850 3350 50  0001 L BNN "Feld6"
F 7 "None" H 2850 3350 50  0001 L BNN "Feld7"
F 8 "Unavailable" H 2850 3350 50  0001 L BNN "Feld8"
	1    2850 3350
	1    0    0    -1  
$EndComp
$Comp
L LED_5050_RGB:SMD-RGB-HI-LIGHT(6P-L5.0*W5.0*H1.5MM) D18
U 1 1 5C2438C2
P 3850 3350
F 0 "D18" H 3850 3667 50  0000 C CNN
F 1 "SMD-RGB-HI-LIGHT(6P-L5.0*W5.0*H1.5MM)" H 3850 3576 50  0000 C CNN
F 2 "LED_SMD:LED_RGB_5050-6" H 3850 3350 50  0001 L BNN
F 3 "Chengguangxing" H 3850 3350 50  0001 L BNN
F 4 "None" H 3850 3350 50  0001 L BNN "Feld4"
F 5 "SMD RGB Hi-Light" H 3850 3350 50  0001 L BNN "Feld5"
F 6 "5050RGB" H 3850 3350 50  0001 L BNN "Feld6"
F 7 "None" H 3850 3350 50  0001 L BNN "Feld7"
F 8 "Unavailable" H 3850 3350 50  0001 L BNN "Feld8"
	1    3850 3350
	1    0    0    -1  
$EndComp
Wire Wire Line
	1350 750  1200 750 
Wire Wire Line
	1200 750  1200 850 
Wire Wire Line
	1200 950  1350 950 
Wire Wire Line
	1350 850  1200 850 
Connection ~ 1200 850 
Wire Wire Line
	1200 850  1200 950 
Wire Wire Line
	1200 850  850  850 
Wire Wire Line
	850  850  850  1350
Wire Wire Line
	850  1350 1200 1350
Wire Wire Line
	850  1350 850  1850
Wire Wire Line
	850  1850 1200 1850
Connection ~ 850  1350
Wire Wire Line
	850  1850 850  2350
Wire Wire Line
	850  2350 1200 2350
Connection ~ 850  1850
Wire Wire Line
	850  2350 850  2850
Wire Wire Line
	850  2850 1200 2850
Connection ~ 850  2350
Wire Wire Line
	850  2850 850  3350
Wire Wire Line
	850  3350 1200 3350
Connection ~ 850  2850
Wire Wire Line
	1350 1250 1200 1250
Wire Wire Line
	1200 1250 1200 1350
Connection ~ 1200 1350
Wire Wire Line
	1200 1350 1350 1350
Wire Wire Line
	1200 1350 1200 1450
Wire Wire Line
	1200 1450 1350 1450
Wire Wire Line
	1350 1750 1200 1750
Wire Wire Line
	1200 1750 1200 1850
Connection ~ 1200 1850
Wire Wire Line
	1200 1850 1350 1850
Wire Wire Line
	1200 1850 1200 1950
Wire Wire Line
	1200 1950 1350 1950
Wire Wire Line
	1350 2250 1200 2250
Wire Wire Line
	1200 2250 1200 2350
Connection ~ 1200 2350
Wire Wire Line
	1200 2350 1350 2350
Wire Wire Line
	1200 2350 1200 2450
Wire Wire Line
	1200 2450 1350 2450
Wire Wire Line
	1350 2750 1200 2750
Wire Wire Line
	1200 2750 1200 2850
Connection ~ 1200 2850
Wire Wire Line
	1200 2850 1350 2850
Wire Wire Line
	1350 2950 1200 2950
Wire Wire Line
	1200 2950 1200 2850
Wire Wire Line
	1350 3250 1200 3250
Wire Wire Line
	1200 3250 1200 3350
Connection ~ 1200 3350
Wire Wire Line
	1200 3350 1350 3350
Wire Wire Line
	1350 3450 1200 3450
Wire Wire Line
	1200 3450 1200 3350
Wire Wire Line
	850  3350 850  3750
Connection ~ 850  3350
Wire Wire Line
	4350 750  5050 750 
Wire Wire Line
	5950 750  5950 1250
Wire Wire Line
	4350 850  4900 850 
Wire Wire Line
	5850 850  5850 1350
Wire Wire Line
	4350 950  4750 950 
Wire Wire Line
	5750 950  5750 1450
Wire Wire Line
	4350 1250 5050 1250
Connection ~ 5950 1250
Wire Wire Line
	5950 1250 5950 1750
Wire Wire Line
	4350 1750 5050 1750
Connection ~ 5950 1750
Wire Wire Line
	5950 1750 5950 2250
Wire Wire Line
	4350 2250 5050 2250
Connection ~ 5950 2250
Wire Wire Line
	5950 2250 5950 2750
Wire Wire Line
	4350 2750 5050 2750
Connection ~ 5950 2750
Wire Wire Line
	5950 2750 5950 3250
Wire Wire Line
	4350 3250 5050 3250
Connection ~ 5950 3250
Wire Wire Line
	4350 1350 4900 1350
Connection ~ 5850 1350
Wire Wire Line
	5850 1350 5850 1850
Wire Wire Line
	4350 1850 4900 1850
Connection ~ 5850 1850
Wire Wire Line
	5850 1850 5850 2350
Wire Wire Line
	4350 2350 4900 2350
Connection ~ 5850 2350
Wire Wire Line
	5850 2350 5850 2850
Wire Wire Line
	4350 2850 4900 2850
Connection ~ 5850 2850
Wire Wire Line
	5850 2850 5850 3350
Wire Wire Line
	4350 3350 4900 3350
Connection ~ 5850 3350
Wire Wire Line
	4350 3450 4750 3450
Connection ~ 5750 3450
Wire Wire Line
	5750 3450 5750 3700
Wire Wire Line
	4350 2950 4750 2950
Connection ~ 5750 2950
Wire Wire Line
	5750 2950 5750 3450
Wire Wire Line
	4350 2450 4750 2450
Connection ~ 5750 2450
Wire Wire Line
	5750 2450 5750 2950
Wire Wire Line
	4350 1950 4750 1950
Connection ~ 5750 1950
Wire Wire Line
	5750 1950 5750 2450
Wire Wire Line
	4350 1450 4750 1450
Connection ~ 5750 1450
Wire Wire Line
	5750 1450 5750 1950
$Comp
L Device:R R6
U 1 1 5C2F2D3E
P 4900 3450
F 0 "R6" V 4693 3450 50  0000 C CNN
F 1 "100" V 4784 3450 50  0000 C CNN
F 2 "Resistor_SMD:R_0805_2012Metric_Pad1.15x1.40mm_HandSolder" V 4830 3450 50  0001 C CNN
F 3 "~" H 4900 3450 50  0001 C CNN
	1    4900 3450
	0    1    1    0   
$EndComp
Wire Wire Line
	5050 3450 5750 3450
$Comp
L Device:R R12
U 1 1 5C2F2E1C
P 5050 3350
F 0 "R12" V 4843 3350 50  0000 C CNN
F 1 "100" V 4934 3350 50  0000 C CNN
F 2 "Resistor_SMD:R_0805_2012Metric_Pad1.15x1.40mm_HandSolder" V 4980 3350 50  0001 C CNN
F 3 "~" H 5050 3350 50  0001 C CNN
	1    5050 3350
	0    1    1    0   
$EndComp
Wire Wire Line
	5200 3350 5850 3350
$Comp
L Device:R R18
U 1 1 5C2F2E9C
P 5200 3250
F 0 "R18" V 4993 3250 50  0000 C CNN
F 1 "100" V 5084 3250 50  0000 C CNN
F 2 "Resistor_SMD:R_0805_2012Metric_Pad1.15x1.40mm_HandSolder" V 5130 3250 50  0001 C CNN
F 3 "~" H 5200 3250 50  0001 C CNN
	1    5200 3250
	0    1    1    0   
$EndComp
Wire Wire Line
	5350 3250 5950 3250
$Comp
L Device:R R17
U 1 1 5C2F2F18
P 5200 2750
F 0 "R17" V 4993 2750 50  0000 C CNN
F 1 "100" V 5084 2750 50  0000 C CNN
F 2 "Resistor_SMD:R_0805_2012Metric_Pad1.15x1.40mm_HandSolder" V 5130 2750 50  0001 C CNN
F 3 "~" H 5200 2750 50  0001 C CNN
	1    5200 2750
	0    1    1    0   
$EndComp
Wire Wire Line
	5350 2750 5950 2750
$Comp
L Device:R R11
U 1 1 5C2F2F9D
P 5050 2850
F 0 "R11" V 4843 2850 50  0000 C CNN
F 1 "100" V 4934 2850 50  0000 C CNN
F 2 "Resistor_SMD:R_0805_2012Metric_Pad1.15x1.40mm_HandSolder" V 4980 2850 50  0001 C CNN
F 3 "~" H 5050 2850 50  0001 C CNN
	1    5050 2850
	0    1    1    0   
$EndComp
Wire Wire Line
	5200 2850 5850 2850
$Comp
L Device:R R5
U 1 1 5C2F3022
P 4900 2950
F 0 "R5" V 4693 2950 50  0000 C CNN
F 1 "100" V 4784 2950 50  0000 C CNN
F 2 "Resistor_SMD:R_0805_2012Metric_Pad1.15x1.40mm_HandSolder" V 4830 2950 50  0001 C CNN
F 3 "~" H 4900 2950 50  0001 C CNN
	1    4900 2950
	0    1    1    0   
$EndComp
Wire Wire Line
	5050 2950 5750 2950
$Comp
L Device:R R16
U 1 1 5C2F30A6
P 5200 2250
F 0 "R16" V 4993 2250 50  0000 C CNN
F 1 "100" V 5084 2250 50  0000 C CNN
F 2 "Resistor_SMD:R_0805_2012Metric_Pad1.15x1.40mm_HandSolder" V 5130 2250 50  0001 C CNN
F 3 "~" H 5200 2250 50  0001 C CNN
	1    5200 2250
	0    1    1    0   
$EndComp
Wire Wire Line
	5350 2250 5950 2250
$Comp
L Device:R R10
U 1 1 5C2F312D
P 5050 2350
F 0 "R10" V 4843 2350 50  0000 C CNN
F 1 "100" V 4934 2350 50  0000 C CNN
F 2 "Resistor_SMD:R_0805_2012Metric_Pad1.15x1.40mm_HandSolder" V 4980 2350 50  0001 C CNN
F 3 "~" H 5050 2350 50  0001 C CNN
	1    5050 2350
	0    1    1    0   
$EndComp
Wire Wire Line
	5200 2350 5850 2350
$Comp
L Device:R R4
U 1 1 5C2F31B7
P 4900 2450
F 0 "R4" V 4693 2450 50  0000 C CNN
F 1 "100" V 4784 2450 50  0000 C CNN
F 2 "Resistor_SMD:R_0805_2012Metric_Pad1.15x1.40mm_HandSolder" V 4830 2450 50  0001 C CNN
F 3 "~" H 4900 2450 50  0001 C CNN
	1    4900 2450
	0    1    1    0   
$EndComp
Wire Wire Line
	5050 2450 5750 2450
$Comp
L Device:R R15
U 1 1 5C2F3329
P 5200 1750
F 0 "R15" V 4993 1750 50  0000 C CNN
F 1 "100" V 5084 1750 50  0000 C CNN
F 2 "Resistor_SMD:R_0805_2012Metric_Pad1.15x1.40mm_HandSolder" V 5130 1750 50  0001 C CNN
F 3 "~" H 5200 1750 50  0001 C CNN
	1    5200 1750
	0    1    1    0   
$EndComp
Wire Wire Line
	5350 1750 5950 1750
$Comp
L Device:R R9
U 1 1 5C2F33B9
P 5050 1850
F 0 "R9" V 4843 1850 50  0000 C CNN
F 1 "100" V 4934 1850 50  0000 C CNN
F 2 "Resistor_SMD:R_0805_2012Metric_Pad1.15x1.40mm_HandSolder" V 4980 1850 50  0001 C CNN
F 3 "~" H 5050 1850 50  0001 C CNN
	1    5050 1850
	0    1    1    0   
$EndComp
Wire Wire Line
	5200 1850 5850 1850
$Comp
L Device:R R3
U 1 1 5C2F3449
P 4900 1950
F 0 "R3" V 4693 1950 50  0000 C CNN
F 1 "100" V 4784 1950 50  0000 C CNN
F 2 "Resistor_SMD:R_0805_2012Metric_Pad1.15x1.40mm_HandSolder" V 4830 1950 50  0001 C CNN
F 3 "~" H 4900 1950 50  0001 C CNN
	1    4900 1950
	0    1    1    0   
$EndComp
Wire Wire Line
	5050 1950 5750 1950
$Comp
L Device:R R2
U 1 1 5C2F37C1
P 4900 1450
F 0 "R2" V 4693 1450 50  0000 C CNN
F 1 "100" V 4784 1450 50  0000 C CNN
F 2 "Resistor_SMD:R_0805_2012Metric_Pad1.15x1.40mm_HandSolder" V 4830 1450 50  0001 C CNN
F 3 "~" H 4900 1450 50  0001 C CNN
	1    4900 1450
	0    1    1    0   
$EndComp
Wire Wire Line
	5050 1450 5750 1450
$Comp
L Device:R R8
U 1 1 5C2F3855
P 5050 1350
F 0 "R8" V 4843 1350 50  0000 C CNN
F 1 "100" V 4934 1350 50  0000 C CNN
F 2 "Resistor_SMD:R_0805_2012Metric_Pad1.15x1.40mm_HandSolder" V 4980 1350 50  0001 C CNN
F 3 "~" H 5050 1350 50  0001 C CNN
	1    5050 1350
	0    1    1    0   
$EndComp
Wire Wire Line
	5200 1350 5850 1350
$Comp
L Device:R R14
U 1 1 5C2F38EC
P 5200 1250
F 0 "R14" V 4993 1250 50  0000 C CNN
F 1 "100" V 5084 1250 50  0000 C CNN
F 2 "Resistor_SMD:R_0805_2012Metric_Pad1.15x1.40mm_HandSolder" V 5130 1250 50  0001 C CNN
F 3 "~" H 5200 1250 50  0001 C CNN
	1    5200 1250
	0    1    1    0   
$EndComp
Wire Wire Line
	5350 1250 5950 1250
$Comp
L Device:R R13
U 1 1 5C2F397F
P 5200 750
F 0 "R13" V 4993 750 50  0000 C CNN
F 1 "100" V 5084 750 50  0000 C CNN
F 2 "Resistor_SMD:R_0805_2012Metric_Pad1.15x1.40mm_HandSolder" V 5130 750 50  0001 C CNN
F 3 "~" H 5200 750 50  0001 C CNN
	1    5200 750 
	0    1    1    0   
$EndComp
Wire Wire Line
	5350 750  5950 750 
$Comp
L Device:R R7
U 1 1 5C2F3A19
P 5050 850
F 0 "R7" V 4843 850 50  0000 C CNN
F 1 "100" V 4934 850 50  0000 C CNN
F 2 "Resistor_SMD:R_0805_2012Metric_Pad1.15x1.40mm_HandSolder" V 4980 850 50  0001 C CNN
F 3 "~" H 5050 850 50  0001 C CNN
	1    5050 850 
	0    1    1    0   
$EndComp
Wire Wire Line
	5200 850  5850 850 
$Comp
L Device:R R1
U 1 1 5C2F3AB7
P 4900 950
F 0 "R1" V 4693 950 50  0000 C CNN
F 1 "100" V 4784 950 50  0000 C CNN
F 2 "Resistor_SMD:R_0805_2012Metric_Pad1.15x1.40mm_HandSolder" V 4830 950 50  0001 C CNN
F 3 "~" H 4900 950 50  0001 C CNN
	1    4900 950 
	0    1    1    0   
$EndComp
Wire Wire Line
	5050 950  5750 950 
$Comp
L Connector:Conn_01x04_Female J1
U 1 1 5C22FCEE
P 3250 4000
F 0 "J1" V 3097 4148 50  0000 L CNN
F 1 "Conn_01x04_Female" V 3188 4148 50  0000 L CNN
F 2 "TerminalBlock_Phoenix:TerminalBlock_Phoenix_MKDS-1,5-4_1x04_P5.00mm_Horizontal" H 3250 4000 50  0001 C CNN
F 3 "~" H 3250 4000 50  0001 C CNN
	1    3250 4000
	0    1    1    0   
$EndComp
$Comp
L Connector:Conn_01x04_Female J2
U 1 1 5C22FE88
P 8850 4050
F 0 "J2" V 8697 4198 50  0000 L CNN
F 1 "Conn_01x04_Female" V 8788 4198 50  0000 L CNN
F 2 "TerminalBlock_Phoenix:TerminalBlock_Phoenix_MKDS-1,5-4_1x04_P5.00mm_Horizontal" H 8850 4050 50  0001 C CNN
F 3 "~" H 8850 4050 50  0001 C CNN
	1    8850 4050
	0    1    1    0   
$EndComp
Wire Wire Line
	850  3750 3050 3750
Wire Wire Line
	3050 3750 3050 3800
Wire Wire Line
	3350 3800 5950 3800
Wire Wire Line
	5950 3250 5950 3800
Wire Wire Line
	5850 3750 3250 3750
Wire Wire Line
	3250 3750 3250 3800
Wire Wire Line
	5850 3350 5850 3750
Wire Wire Line
	5750 3700 3150 3700
Wire Wire Line
	3150 3700 3150 3800
Wire Wire Line
	11000 2850 11000 3350
Wire Wire Line
	10900 3750 8850 3750
Wire Wire Line
	8850 3750 8850 3850
Wire Wire Line
	10900 2950 10900 3450
Wire Wire Line
	10800 3650 8750 3650
Wire Wire Line
	8750 3650 8750 3850
Wire Wire Line
	8650 3850 6300 3850
Wire Wire Line
	6300 2950 6300 3450
Wire Wire Line
	10800 2550 10800 3050
Wire Wire Line
	10350 3050 10800 3050
Connection ~ 10800 3050
Wire Wire Line
	11000 3850 8950 3850
$Comp
L LED_5050_RGB:SMD-RGB-HI-LIGHT(6P-L5.0*W5.0*H1.5MM) D34
U 1 1 5C3548BD
P 7300 3450
F 0 "D34" H 7300 3767 50  0000 C CNN
F 1 "SMD-RGB-HI-LIGHT(6P-L5.0*W5.0*H1.5MM)" H 7300 3676 50  0000 C CNN
F 2 "LED_SMD:LED_RGB_5050-6" H 7300 3450 50  0001 L BNN
F 3 "Chengguangxing" H 7300 3450 50  0001 L BNN
F 4 "None" H 7300 3450 50  0001 L BNN "Feld4"
F 5 "SMD RGB Hi-Light" H 7300 3450 50  0001 L BNN "Feld5"
F 6 "5050RGB" H 7300 3450 50  0001 L BNN "Feld6"
F 7 "None" H 7300 3450 50  0001 L BNN "Feld7"
F 8 "Unavailable" H 7300 3450 50  0001 L BNN "Feld8"
	1    7300 3450
	1    0    0    -1  
$EndComp
$Comp
L LED_5050_RGB:SMD-RGB-HI-LIGHT(6P-L5.0*W5.0*H1.5MM) D35
U 1 1 5C3548C8
P 8300 3450
F 0 "D35" H 8300 3767 50  0000 C CNN
F 1 "SMD-RGB-HI-LIGHT(6P-L5.0*W5.0*H1.5MM)" H 8300 3676 50  0000 C CNN
F 2 "LED_SMD:LED_RGB_5050-6" H 8300 3450 50  0001 L BNN
F 3 "Chengguangxing" H 8300 3450 50  0001 L BNN
F 4 "None" H 8300 3450 50  0001 L BNN "Feld4"
F 5 "SMD RGB Hi-Light" H 8300 3450 50  0001 L BNN "Feld5"
F 6 "5050RGB" H 8300 3450 50  0001 L BNN "Feld6"
F 7 "None" H 8300 3450 50  0001 L BNN "Feld7"
F 8 "Unavailable" H 8300 3450 50  0001 L BNN "Feld8"
	1    8300 3450
	1    0    0    -1  
$EndComp
$Comp
L LED_5050_RGB:SMD-RGB-HI-LIGHT(6P-L5.0*W5.0*H1.5MM) D36
U 1 1 5C3548D3
P 9300 3450
F 0 "D36" H 9300 3767 50  0000 C CNN
F 1 "SMD-RGB-HI-LIGHT(6P-L5.0*W5.0*H1.5MM)" H 9300 3676 50  0000 C CNN
F 2 "LED_SMD:LED_RGB_5050-6" H 9300 3450 50  0001 L BNN
F 3 "Chengguangxing" H 9300 3450 50  0001 L BNN
F 4 "None" H 9300 3450 50  0001 L BNN "Feld4"
F 5 "SMD RGB Hi-Light" H 9300 3450 50  0001 L BNN "Feld5"
F 6 "5050RGB" H 9300 3450 50  0001 L BNN "Feld6"
F 7 "None" H 9300 3450 50  0001 L BNN "Feld7"
F 8 "Unavailable" H 9300 3450 50  0001 L BNN "Feld8"
	1    9300 3450
	1    0    0    -1  
$EndComp
Wire Wire Line
	6800 3350 6700 3350
Wire Wire Line
	6700 3350 6700 3450
Connection ~ 6700 3450
Wire Wire Line
	6700 3450 6800 3450
Wire Wire Line
	6800 3550 6700 3550
Wire Wire Line
	6700 3550 6700 3450
Wire Wire Line
	9800 3350 10400 3350
Wire Wire Line
	9800 3450 10250 3450
Wire Wire Line
	9800 3550 10050 3550
Wire Wire Line
	6300 3450 6700 3450
$Comp
L Device:R R34
U 1 1 5C3548E3
P 10200 3550
F 0 "R34" V 9993 3550 50  0000 C CNN
F 1 "130" V 10084 3550 50  0000 C CNN
F 2 "Resistor_SMD:R_0805_2012Metric_Pad1.15x1.40mm_HandSolder" V 10130 3550 50  0001 C CNN
F 3 "~" H 10200 3550 50  0001 C CNN
	1    10200 3550
	0    1    1    0   
$EndComp
$Comp
L Device:R R35
U 1 1 5C3548E9
P 10400 3450
F 0 "R35" V 10193 3450 50  0000 C CNN
F 1 "300" V 10284 3450 50  0000 C CNN
F 2 "Resistor_SMD:R_0805_2012Metric_Pad1.15x1.40mm_HandSolder" V 10330 3450 50  0001 C CNN
F 3 "~" H 10400 3450 50  0001 C CNN
	1    10400 3450
	0    1    1    0   
$EndComp
Wire Wire Line
	10550 3450 10800 3450
$Comp
L Device:R R36
U 1 1 5C3548F0
P 10550 3350
F 0 "R36" V 10343 3350 50  0000 C CNN
F 1 "130" V 10434 3350 50  0000 C CNN
F 2 "Resistor_SMD:R_0805_2012Metric_Pad1.15x1.40mm_HandSolder" V 10480 3350 50  0001 C CNN
F 3 "~" H 10550 3350 50  0001 C CNN
	1    10550 3350
	0    1    1    0   
$EndComp
Wire Wire Line
	10700 3350 11000 3350
Wire Wire Line
	10350 3550 10800 3550
Connection ~ 6300 3450
Wire Wire Line
	6300 3450 6300 3850
Wire Wire Line
	10800 3450 10900 3450
Connection ~ 10800 3550
Wire Wire Line
	10800 3550 10800 3650
Connection ~ 10900 3450
Wire Wire Line
	10900 3450 10900 3750
Connection ~ 11000 3350
Wire Wire Line
	11000 3350 11000 3850
Wire Wire Line
	10800 3050 10800 3550
Text Label 10800 3650 0    50   ~ 0
B
Text Label 10900 3600 0    50   ~ 0
R
$EndSCHEMATC
