(export (version D)
  (design
    (source /Users/alexanderkutschera/GitLab/singingplants/pcb_v3/sensor.sch)
    (date "Sonntag, 24. März 2019 um 15:38:22")
    (tool "Eeschema (5.0.0-3-g5ebb6b6)")
    (sheet (number 1) (name /) (tstamps /)
      (title_block
        (title "Plant sensor")
        (company)
        (rev 0.1)
        (date 2018-12-08)
        (source sensor.sch)
        (comment (number 1) (value ""))
        (comment (number 2) (value ""))
        (comment (number 3) (value ""))
        (comment (number 4) (value "")))))
  (components
    (comp (ref C1)
      (value 100nF)
      (footprint Capacitor_SMD:C_0805_2012Metric_Pad1.15x1.40mm_HandSolder)
      (libsource (lib pspice) (part CAP) (description ""))
      (sheetpath (names /) (tstamps /))
      (tstamp 5C0C1595))
    (comp (ref C2)
      (value 100nF)
      (footprint Capacitor_SMD:C_0805_2012Metric_Pad1.15x1.40mm_HandSolder)
      (libsource (lib pspice) (part CAP) (description ""))
      (sheetpath (names /) (tstamps /))
      (tstamp 5C0C1806))
    (comp (ref R4)
      (value 22k)
      (footprint Resistor_SMD:R_0805_2012Metric_Pad1.15x1.40mm_HandSolder)
      (datasheet ~)
      (libsource (lib Device) (part R) (description Resistor))
      (sheetpath (names /) (tstamps /))
      (tstamp 5C0C1C0F))
    (comp (ref D1)
      (value LED)
      (footprint LED_THT:LED_D5.0mm)
      (datasheet ~)
      (libsource (lib Device) (part LED) (description "LED generic"))
      (sheetpath (names /) (tstamps /))
      (tstamp 5C0C2364))
    (comp (ref R2)
      (value 100)
      (footprint Resistor_SMD:R_0805_2012Metric_Pad1.15x1.40mm_HandSolder)
      (datasheet ~)
      (libsource (lib Device) (part R) (description Resistor))
      (sheetpath (names /) (tstamps /))
      (tstamp 5C0C23EB))
    (comp (ref D4)
      (value WS2812B)
      (footprint LED_SMD:LED_WS2812B_PLCC4_5.0x5.0mm_P3.2mm)
      (datasheet https://cdn-shop.adafruit.com/datasheets/WS2812B.pdf)
      (libsource (lib LED) (part WS2812B) (description "RGB LED with integrated controller"))
      (sheetpath (names /) (tstamps /))
      (tstamp 5C0C29E3))
    (comp (ref D3)
      (value WS2812B)
      (footprint LED_SMD:LED_WS2812B_PLCC4_5.0x5.0mm_P3.2mm)
      (datasheet https://cdn-shop.adafruit.com/datasheets/WS2812B.pdf)
      (libsource (lib LED) (part WS2812B) (description "RGB LED with integrated controller"))
      (sheetpath (names /) (tstamps /))
      (tstamp 5C0C2A99))
    (comp (ref R6)
      (value 100)
      (footprint Resistor_SMD:R_0805_2012Metric_Pad1.15x1.40mm_HandSolder)
      (datasheet ~)
      (libsource (lib Device) (part R) (description Resistor))
      (sheetpath (names /) (tstamps /))
      (tstamp 5C0C305B))
    (comp (ref BZ1)
      (value Buzzer)
      (footprint Buzzer_Beeper:Buzzer_12x9.5RM7.6)
      (datasheet ~)
      (libsource (lib Device) (part Buzzer) (description "Buzzer, polar"))
      (sheetpath (names /) (tstamps /))
      (tstamp 5C0C4CB5))
    (comp (ref R3)
      (value 100)
      (footprint Resistor_SMD:R_0805_2012Metric_Pad1.15x1.40mm_HandSolder)
      (datasheet ~)
      (libsource (lib Device) (part R) (description Resistor))
      (sheetpath (names /) (tstamps /))
      (tstamp 5C0C4D65))
    (comp (ref RV1)
      (value R_POT)
      (footprint Potentiometer_SMD:Potentiometer_Bourns_3214J_Horizontal)
      (datasheet ~)
      (libsource (lib Device) (part R_POT) (description Potentiometer))
      (sheetpath (names /) (tstamps /))
      (tstamp 5C0C7D65))
    (comp (ref R1)
      (value 10k)
      (footprint Resistor_SMD:R_0805_2012Metric_Pad1.15x1.40mm_HandSolder)
      (datasheet ~)
      (libsource (lib Device) (part R) (description Resistor))
      (sheetpath (names /) (tstamps /))
      (tstamp 5C0CAD26))
    (comp (ref J2)
      (value SJ-3524-SMT)
      (footprint SJ-3524-SMT:CUI_SJ-3524-SMT)
      (datasheet Unavailable)
      (fields
        (field (name Feld4) None)
        (field (name Feld5) None)
        (field (name Feld6) SJ-3524-SMT-TR)
        (field (name Feld7) "SJ Series 3.5 mm 12 V SMT Right Angle Stereo Audio Jack")
        (field (name Feld8) https://www.cui.com/product/interconnect/audio-connectors/3.5-mm-jacks/sj-352x-smt-series?utm_source=snapeda.com&utm_medium=referral&utm_campaign=snapedaBOM)
        (field (name Feld9) "CUI Inc."))
      (libsource (lib sensor-rescue) (part SJ-3524-SMT-SJ-3524-SMT) (description ""))
      (sheetpath (names /) (tstamps /))
      (tstamp 5C167B3F))
    (comp (ref S1)
      (value 1825910-7)
      (footprint 1825910-7:SW_1825910-7)
      (datasheet "TE Connectivity")
      (fields
        (field (name Feld10) 1825910-7)
        (field (name Feld4) https://www.te.com/usa-en/product-1825910-7.html?te_bu=Cor&te_type=disp&te_campaign=seda_glo_cor-seda-global-disp-prtnr-fy19-seda-model-bom-cta_sma-317_1&elqCampaignId=32493)
        (field (name Feld5) None)
        (field (name Feld6) "Switch Tactile OFF _ON_ SPST Round Button PC Pins 0.05A 24VDC 100000Cycle 2.55N Thru-Hole Loose Piece")
        (field (name Feld7) 1825910-7)
        (field (name Feld8) Unavailable)
        (field (name Feld9) None))
      (libsource (lib sensor-rescue) (part 1825910-7-1825910-7) (description ""))
      (sheetpath (names /) (tstamps /))
      (tstamp 5C165B42))
    (comp (ref SW1)
      (value PCM12SMTR)
      (footprint PCM12SMTR:SW_PCM12SMTR)
      (datasheet https://www.digikey.de/product-detail/en/c-k/PCM12SMTR/401-2016-1-ND/1640125?utm_source=snapeda&utm_medium=aggregator&utm_campaign=symbol)
      (fields
        (field (name Feld4) "DO-201 C&amp;K Components")
        (field (name Feld5) PCM12SMTR)
        (field (name Feld6) 401-2016-1-ND)
        (field (name Feld7) "Switch Slide ON ON SPDT Side Slide 0.3A 6VDC 10000Cycles Gull Wing SMD T/R")
        (field (name Feld8) C&K))
      (libsource (lib sensor-rescue) (part PCM12SMTR-PCM12SMTR) (description ""))
      (sheetpath (names /) (tstamps /))
      (tstamp 5C238C31))
    (comp (ref R5)
      (value 22k)
      (footprint Resistor_SMD:R_0805_2012Metric_Pad1.15x1.40mm_HandSolder)
      (datasheet ~)
      (libsource (lib Device) (part R) (description Resistor))
      (sheetpath (names /) (tstamps /))
      (tstamp 5C0C1C9C))
    (comp (ref U1)
      (value ATtiny85-20PU)
      (footprint Package_DIP:DIP-8_W7.62mm)
      (datasheet http://ww1.microchip.com/downloads/en/DeviceDoc/atmel-2586-avr-8-bit-microcontroller-attiny25-attiny45-attiny85_datasheet.pdf)
      (libsource (lib sensor-rescue) (part ATtiny85-20PU-MCU_Microchip_ATtiny) (description ""))
      (sheetpath (names /) (tstamps /))
      (tstamp 5C0C143D))
    (comp (ref U2)
      (value BAT-HLD-001)
      (footprint BAT-HLD-001:BAT-HLD-001)
      (datasheet None)
      (fields
        (field (name Feld4) None)
        (field (name Feld5) BAT-HLD-001-TR)
        (field (name Feld6) Unavailable)
        (field (name Feld7) "Linx Technologies")
        (field (name Feld8) "CR2032 Battery Holder Surface Mount Tape and Reel"))
      (libsource (lib sensor-rescue) (part BAT-HLD-001-BAT-HLD-001) (description ""))
      (sheetpath (names /) (tstamps /))
      (tstamp 5C2389FB))
    (comp (ref R7)
      (value 10k)
      (footprint Resistor_SMD:R_0805_2012Metric_Pad1.15x1.40mm_HandSolder)
      (datasheet ~)
      (libsource (lib Device) (part R) (description Resistor))
      (sheetpath (names /) (tstamps /))
      (tstamp 5C9D6F8A)))
  (libparts
    (libpart (lib Device) (part Buzzer)
      (description "Buzzer, polar")
      (docs ~)
      (footprints
        (fp *Buzzer*))
      (fields
        (field (name Reference) BZ)
        (field (name Value) Buzzer))
      (pins
        (pin (num 1) (name -) (type passive))
        (pin (num 2) (name +) (type passive))))
    (libpart (lib Device) (part LED)
      (description "LED generic")
      (docs ~)
      (footprints
        (fp LED*)
        (fp LED_SMD:*)
        (fp LED_THT:*))
      (fields
        (field (name Reference) D)
        (field (name Value) LED))
      (pins
        (pin (num 1) (name K) (type passive))
        (pin (num 2) (name A) (type passive))))
    (libpart (lib Device) (part R)
      (description Resistor)
      (docs ~)
      (footprints
        (fp R_*))
      (fields
        (field (name Reference) R)
        (field (name Value) R))
      (pins
        (pin (num 1) (name ~) (type passive))
        (pin (num 2) (name ~) (type passive))))
    (libpart (lib Device) (part R_POT)
      (description Potentiometer)
      (docs ~)
      (footprints
        (fp Potentiometer*))
      (fields
        (field (name Reference) RV)
        (field (name Value) R_POT))
      (pins
        (pin (num 1) (name 1) (type passive))
        (pin (num 2) (name 2) (type passive))
        (pin (num 3) (name 3) (type passive))))
    (libpart (lib LED) (part WS2812B)
      (description "RGB LED with integrated controller")
      (docs https://cdn-shop.adafruit.com/datasheets/WS2812B.pdf)
      (footprints
        (fp LED*WS2812*PLCC*5.0x5.0mm*P3.2mm*))
      (fields
        (field (name Reference) D)
        (field (name Value) WS2812B)
        (field (name Footprint) LED_SMD:LED_WS2812B_PLCC4_5.0x5.0mm_P3.2mm))
      (pins
        (pin (num 1) (name VDD) (type power_in))
        (pin (num 2) (name DOUT) (type output))
        (pin (num 3) (name VSS) (type power_in))
        (pin (num 4) (name DIN) (type input))))
    (libpart (lib pspice) (part CAP)
      (aliases
        (alias C))
      (fields
        (field (name Reference) C)
        (field (name Value) CAP))
      (pins
        (pin (num 1) (name ~) (type passive))
        (pin (num 2) (name ~) (type passive))))
    (libpart (lib sensor-rescue) (part 1825910-7-1825910-7)
      (fields
        (field (name Reference) S)
        (field (name Value) 1825910-7-1825910-7)
        (field (name Footprint) SW_1825910-7)
        (field (name Datasheet) "TE Connectivity")
        (field (name Feld4) https://www.te.com/usa-en/product-1825910-7.html?te_bu=Cor&te_type=disp&te_campaign=seda_glo_cor-seda-global-disp-prtnr-fy19-seda-model-bom-cta_sma-317_1&elqCampaignId=32493)
        (field (name Feld5) None)
        (field (name Feld6) "Switch Tactile OFF _ON_ SPST Round Button PC Pins 0.05A 24VDC 100000Cycle 2.55N Thru-Hole Loose Piece")
        (field (name Feld7) 1825910-7)
        (field (name Feld8) Unavailable)
        (field (name Feld9) None)
        (field (name Feld10) 1825910-7))
      (pins
        (pin (num 1) (name 1) (type passive))
        (pin (num 2) (name 2) (type passive))
        (pin (num 3) (name 3) (type passive))
        (pin (num 4) (name 4) (type passive))))
    (libpart (lib sensor-rescue) (part ATtiny85-20PU-MCU_Microchip_ATtiny)
      (footprints
        (fp DIP*W7.62mm*))
      (fields
        (field (name Reference) U)
        (field (name Value) ATtiny85-20PU-MCU_Microchip_ATtiny)
        (field (name Footprint) Package_DIP:DIP-8_W7.62mm))
      (pins
        (pin (num 1) (name ~RESET~/PB5) (type BiDi))
        (pin (num 2) (name XTAL1/PB3) (type BiDi))
        (pin (num 3) (name XTAL2/PB4) (type BiDi))
        (pin (num 4) (name GND) (type power_in))
        (pin (num 5) (name AREF/PB0) (type BiDi))
        (pin (num 6) (name PB1) (type BiDi))
        (pin (num 7) (name PB2) (type BiDi))
        (pin (num 8) (name VCC) (type power_in))))
    (libpart (lib sensor-rescue) (part BAT-HLD-001-BAT-HLD-001)
      (fields
        (field (name Reference) U)
        (field (name Value) BAT-HLD-001-BAT-HLD-001)
        (field (name Footprint) BAT-HLD-001)
        (field (name Datasheet) None)
        (field (name Feld4) None)
        (field (name Feld5) BAT-HLD-001-TR)
        (field (name Feld6) Unavailable)
        (field (name Feld7) "Linx Technologies")
        (field (name Feld8) "CR2032 Battery Holder Surface Mount Tape and Reel"))
      (pins
        (pin (num +@1) (name +@1) (type BiDi))
        (pin (num +@2) (name +@2) (type BiDi))
        (pin (num -) (name -) (type BiDi))))
    (libpart (lib sensor-rescue) (part PCM12SMTR-PCM12SMTR)
      (fields
        (field (name Reference) SW)
        (field (name Value) PCM12SMTR-PCM12SMTR)
        (field (name Footprint) SW_PCM12SMTR)
        (field (name Datasheet) https://www.digikey.de/product-detail/en/c-k/PCM12SMTR/401-2016-1-ND/1640125?utm_source=snapeda&utm_medium=aggregator&utm_campaign=symbol)
        (field (name Feld4) "DO-201 C&amp;K Components")
        (field (name Feld5) PCM12SMTR)
        (field (name Feld6) 401-2016-1-ND)
        (field (name Feld7) "Switch Slide ON ON SPDT Side Slide 0.3A 6VDC 10000Cycles Gull Wing SMD T/R")
        (field (name Feld8) C&K))
      (pins
        (pin (num 1) (name 1) (type passive))
        (pin (num 2) (name 2) (type passive))
        (pin (num 3) (name 3) (type passive))
        (pin (num S1) (name SHIELD) (type passive))
        (pin (num S2) (name SHIELD) (type passive))
        (pin (num S3) (name SHIELD) (type passive))
        (pin (num S4) (name SHIELD) (type passive))))
    (libpart (lib sensor-rescue) (part SJ-3524-SMT-SJ-3524-SMT)
      (fields
        (field (name Reference) J)
        (field (name Value) SJ-3524-SMT-SJ-3524-SMT)
        (field (name Footprint) CUI_SJ-3524-SMT)
        (field (name Datasheet) Unavailable)
        (field (name Feld4) None)
        (field (name Feld5) None)
        (field (name Feld6) SJ-3524-SMT-TR)
        (field (name Feld7) "SJ Series 3.5 mm 12 V SMT Right Angle Stereo Audio Jack")
        (field (name Feld8) https://www.cui.com/product/interconnect/audio-connectors/3.5-mm-jacks/sj-352x-smt-series?utm_source=snapeda.com&utm_medium=referral&utm_campaign=snapedaBOM)
        (field (name Feld9) "CUI Inc."))
      (pins
        (pin (num 1) (name 1) (type passive))
        (pin (num 2) (name 2) (type passive))
        (pin (num 3) (name 3) (type passive))
        (pin (num 4) (name 4) (type passive)))))
  (libraries
    (library (logical Device)
      (uri "/Library/Application Support/kicad/library/Device.lib"))
    (library (logical LED)
      (uri "/Library/Application Support/kicad/library/LED.lib"))
    (library (logical pspice)
      (uri "/Library/Application Support/kicad/library/pspice.lib"))
    (library (logical sensor-rescue)
      (uri /Users/alexanderkutschera/GitLab/singingplants/pcb_v3/sensor-rescue.lib)))
  (nets
    (net (code 1) (name "Net-(C2-Pad2)")
      (node (ref J2) (pin 2))
      (node (ref C2) (pin 2)))
    (net (code 2) (name "Net-(D1-Pad2)")
      (node (ref D1) (pin 2))
      (node (ref R2) (pin 2)))
    (net (code 3) (name "Net-(D3-Pad4)")
      (node (ref D4) (pin 2))
      (node (ref D3) (pin 4)))
    (net (code 4) (name "Net-(D4-Pad4)")
      (node (ref R6) (pin 1))
      (node (ref D4) (pin 4)))
    (net (code 5) (name "Net-(D3-Pad2)")
      (node (ref D3) (pin 2)))
    (net (code 6) (name "Net-(BZ1-Pad1)")
      (node (ref U1) (pin 5))
      (node (ref BZ1) (pin 1)))
    (net (code 7) (name "Net-(BZ1-Pad2)")
      (node (ref BZ1) (pin 2))
      (node (ref R3) (pin 1)))
    (net (code 8) (name "Net-(RV1-Pad3)")
      (node (ref RV1) (pin 3)))
    (net (code 9) (name "Net-(J2-Pad3)")
      (node (ref J2) (pin 3)))
    (net (code 10) (name "Net-(J2-Pad4)")
      (node (ref J2) (pin 4)))
    (net (code 11) (name "Net-(S1-Pad2)")
      (node (ref S1) (pin 2)))
    (net (code 12) (name "Net-(R7-Pad1)")
      (node (ref R7) (pin 1))
      (node (ref S1) (pin 4)))
    (net (code 13) (name /worm1)
      (node (ref RV1) (pin 2)))
    (net (code 14) (name "Net-(SW1-Pad1)")
      (node (ref SW1) (pin 1)))
    (net (code 15) (name "Net-(SW1-Pad3)")
      (node (ref U2) (pin +@1))
      (node (ref U2) (pin +@2))
      (node (ref SW1) (pin 3)))
    (net (code 16) (name "Net-(SW1-PadS1)")
      (node (ref SW1) (pin S4))
      (node (ref SW1) (pin S3))
      (node (ref SW1) (pin S2))
      (node (ref SW1) (pin S1)))
    (net (code 17) (name "Net-(C2-Pad1)")
      (node (ref C2) (pin 1))
      (node (ref R5) (pin 1))
      (node (ref R4) (pin 2))
      (node (ref U1) (pin 2)))
    (net (code 18) (name "Net-(C1-Pad2)")
      (node (ref U1) (pin 4))
      (node (ref U2) (pin -))
      (node (ref R5) (pin 2))
      (node (ref S1) (pin 1))
      (node (ref J2) (pin 1))
      (node (ref R1) (pin 1))
      (node (ref R3) (pin 2))
      (node (ref D3) (pin 3))
      (node (ref C1) (pin 2))
      (node (ref D1) (pin 1))
      (node (ref D4) (pin 3)))
    (net (code 19) (name "Net-(S1-Pad3)")
      (node (ref S1) (pin 3))
      (node (ref U1) (pin 1)))
    (net (code 20) (name "Net-(R6-Pad2)")
      (node (ref R6) (pin 2))
      (node (ref U1) (pin 3)))
    (net (code 21) (name /worm2)
      (node (ref R2) (pin 1))
      (node (ref U1) (pin 6)))
    (net (code 22) (name "Net-(R1-Pad2)")
      (node (ref U1) (pin 7))
      (node (ref RV1) (pin 1))
      (node (ref R1) (pin 2)))
    (net (code 23) (name "Net-(C1-Pad1)")
      (node (ref C1) (pin 1))
      (node (ref U1) (pin 8))
      (node (ref SW1) (pin 2))
      (node (ref D3) (pin 1))
      (node (ref D4) (pin 1))
      (node (ref R4) (pin 1))
      (node (ref R7) (pin 2)))))