G04 #@! TF.GenerationSoftware,KiCad,Pcbnew,(5.0.0-3-g5ebb6b6)*
G04 #@! TF.CreationDate,2019-04-08T21:46:59+02:00*
G04 #@! TF.ProjectId,sensor,73656E736F722E6B696361645F706362,rev?*
G04 #@! TF.SameCoordinates,Original*
G04 #@! TF.FileFunction,Other,Fab,Top*
%FSLAX46Y46*%
G04 Gerber Fmt 4.6, Leading zero omitted, Abs format (unit mm)*
G04 Created by KiCad (PCBNEW (5.0.0-3-g5ebb6b6)) date Monday, 08. April 2019 um 21:46:59*
%MOMM*%
%LPD*%
G01*
G04 APERTURE LIST*
%ADD10C,0.100000*%
%ADD11C,0.150000*%
G04 APERTURE END LIST*
D10*
G04 #@! TO.C,D3*
X103600000Y-102870000D02*
G75*
G03X103600000Y-102870000I-2000000J0D01*
G01*
X99100000Y-100370000D02*
X99100000Y-105370000D01*
X104100000Y-100370000D02*
X99100000Y-100370000D01*
X104100000Y-105370000D02*
X104100000Y-100370000D01*
X99100000Y-105370000D02*
X104100000Y-105370000D01*
X103100000Y-100370000D02*
X104100000Y-101370000D01*
G04 #@! TO.C,D4*
X104370000Y-63540000D02*
X105370000Y-64540000D01*
X100370000Y-68540000D02*
X105370000Y-68540000D01*
X105370000Y-68540000D02*
X105370000Y-63540000D01*
X105370000Y-63540000D02*
X100370000Y-63540000D01*
X100370000Y-63540000D02*
X100370000Y-68540000D01*
X104870000Y-66040000D02*
G75*
G03X104870000Y-66040000I-2000000J0D01*
G01*
G04 #@! TD*
G04 #@! TO.C,D3*
D11*
X105052380Y-106179523D02*
X106052380Y-105941428D01*
X105338095Y-105750952D01*
X106052380Y-105560476D01*
X105052380Y-105322380D01*
X106004761Y-104989047D02*
X106052380Y-104846190D01*
X106052380Y-104608095D01*
X106004761Y-104512857D01*
X105957142Y-104465238D01*
X105861904Y-104417619D01*
X105766666Y-104417619D01*
X105671428Y-104465238D01*
X105623809Y-104512857D01*
X105576190Y-104608095D01*
X105528571Y-104798571D01*
X105480952Y-104893809D01*
X105433333Y-104941428D01*
X105338095Y-104989047D01*
X105242857Y-104989047D01*
X105147619Y-104941428D01*
X105100000Y-104893809D01*
X105052380Y-104798571D01*
X105052380Y-104560476D01*
X105100000Y-104417619D01*
X105147619Y-104036666D02*
X105100000Y-103989047D01*
X105052380Y-103893809D01*
X105052380Y-103655714D01*
X105100000Y-103560476D01*
X105147619Y-103512857D01*
X105242857Y-103465238D01*
X105338095Y-103465238D01*
X105480952Y-103512857D01*
X106052380Y-104084285D01*
X106052380Y-103465238D01*
X105480952Y-102893809D02*
X105433333Y-102989047D01*
X105385714Y-103036666D01*
X105290476Y-103084285D01*
X105242857Y-103084285D01*
X105147619Y-103036666D01*
X105100000Y-102989047D01*
X105052380Y-102893809D01*
X105052380Y-102703333D01*
X105100000Y-102608095D01*
X105147619Y-102560476D01*
X105242857Y-102512857D01*
X105290476Y-102512857D01*
X105385714Y-102560476D01*
X105433333Y-102608095D01*
X105480952Y-102703333D01*
X105480952Y-102893809D01*
X105528571Y-102989047D01*
X105576190Y-103036666D01*
X105671428Y-103084285D01*
X105861904Y-103084285D01*
X105957142Y-103036666D01*
X106004761Y-102989047D01*
X106052380Y-102893809D01*
X106052380Y-102703333D01*
X106004761Y-102608095D01*
X105957142Y-102560476D01*
X105861904Y-102512857D01*
X105671428Y-102512857D01*
X105576190Y-102560476D01*
X105528571Y-102608095D01*
X105480952Y-102703333D01*
X106052380Y-101560476D02*
X106052380Y-102131904D01*
X106052380Y-101846190D02*
X105052380Y-101846190D01*
X105195238Y-101941428D01*
X105290476Y-102036666D01*
X105338095Y-102131904D01*
X105147619Y-101179523D02*
X105100000Y-101131904D01*
X105052380Y-101036666D01*
X105052380Y-100798571D01*
X105100000Y-100703333D01*
X105147619Y-100655714D01*
X105242857Y-100608095D01*
X105338095Y-100608095D01*
X105480952Y-100655714D01*
X106052380Y-101227142D01*
X106052380Y-100608095D01*
X105528571Y-99846190D02*
X105576190Y-99703333D01*
X105623809Y-99655714D01*
X105719047Y-99608095D01*
X105861904Y-99608095D01*
X105957142Y-99655714D01*
X106004761Y-99703333D01*
X106052380Y-99798571D01*
X106052380Y-100179523D01*
X105052380Y-100179523D01*
X105052380Y-99846190D01*
X105100000Y-99750952D01*
X105147619Y-99703333D01*
X105242857Y-99655714D01*
X105338095Y-99655714D01*
X105433333Y-99703333D01*
X105480952Y-99750952D01*
X105528571Y-99846190D01*
X105528571Y-100179523D01*
X101961904Y-103460476D02*
X101161904Y-103460476D01*
X101161904Y-103270000D01*
X101200000Y-103155714D01*
X101276190Y-103079523D01*
X101352380Y-103041428D01*
X101504761Y-103003333D01*
X101619047Y-103003333D01*
X101771428Y-103041428D01*
X101847619Y-103079523D01*
X101923809Y-103155714D01*
X101961904Y-103270000D01*
X101961904Y-103460476D01*
X101161904Y-102736666D02*
X101161904Y-102241428D01*
X101466666Y-102508095D01*
X101466666Y-102393809D01*
X101504761Y-102317619D01*
X101542857Y-102279523D01*
X101619047Y-102241428D01*
X101809523Y-102241428D01*
X101885714Y-102279523D01*
X101923809Y-102317619D01*
X101961904Y-102393809D01*
X101961904Y-102622380D01*
X101923809Y-102698571D01*
X101885714Y-102736666D01*
G04 #@! TO.C,D4*
X106322380Y-69349523D02*
X107322380Y-69111428D01*
X106608095Y-68920952D01*
X107322380Y-68730476D01*
X106322380Y-68492380D01*
X107274761Y-68159047D02*
X107322380Y-68016190D01*
X107322380Y-67778095D01*
X107274761Y-67682857D01*
X107227142Y-67635238D01*
X107131904Y-67587619D01*
X107036666Y-67587619D01*
X106941428Y-67635238D01*
X106893809Y-67682857D01*
X106846190Y-67778095D01*
X106798571Y-67968571D01*
X106750952Y-68063809D01*
X106703333Y-68111428D01*
X106608095Y-68159047D01*
X106512857Y-68159047D01*
X106417619Y-68111428D01*
X106370000Y-68063809D01*
X106322380Y-67968571D01*
X106322380Y-67730476D01*
X106370000Y-67587619D01*
X106417619Y-67206666D02*
X106370000Y-67159047D01*
X106322380Y-67063809D01*
X106322380Y-66825714D01*
X106370000Y-66730476D01*
X106417619Y-66682857D01*
X106512857Y-66635238D01*
X106608095Y-66635238D01*
X106750952Y-66682857D01*
X107322380Y-67254285D01*
X107322380Y-66635238D01*
X106750952Y-66063809D02*
X106703333Y-66159047D01*
X106655714Y-66206666D01*
X106560476Y-66254285D01*
X106512857Y-66254285D01*
X106417619Y-66206666D01*
X106370000Y-66159047D01*
X106322380Y-66063809D01*
X106322380Y-65873333D01*
X106370000Y-65778095D01*
X106417619Y-65730476D01*
X106512857Y-65682857D01*
X106560476Y-65682857D01*
X106655714Y-65730476D01*
X106703333Y-65778095D01*
X106750952Y-65873333D01*
X106750952Y-66063809D01*
X106798571Y-66159047D01*
X106846190Y-66206666D01*
X106941428Y-66254285D01*
X107131904Y-66254285D01*
X107227142Y-66206666D01*
X107274761Y-66159047D01*
X107322380Y-66063809D01*
X107322380Y-65873333D01*
X107274761Y-65778095D01*
X107227142Y-65730476D01*
X107131904Y-65682857D01*
X106941428Y-65682857D01*
X106846190Y-65730476D01*
X106798571Y-65778095D01*
X106750952Y-65873333D01*
X107322380Y-64730476D02*
X107322380Y-65301904D01*
X107322380Y-65016190D02*
X106322380Y-65016190D01*
X106465238Y-65111428D01*
X106560476Y-65206666D01*
X106608095Y-65301904D01*
X106417619Y-64349523D02*
X106370000Y-64301904D01*
X106322380Y-64206666D01*
X106322380Y-63968571D01*
X106370000Y-63873333D01*
X106417619Y-63825714D01*
X106512857Y-63778095D01*
X106608095Y-63778095D01*
X106750952Y-63825714D01*
X107322380Y-64397142D01*
X107322380Y-63778095D01*
X106798571Y-63016190D02*
X106846190Y-62873333D01*
X106893809Y-62825714D01*
X106989047Y-62778095D01*
X107131904Y-62778095D01*
X107227142Y-62825714D01*
X107274761Y-62873333D01*
X107322380Y-62968571D01*
X107322380Y-63349523D01*
X106322380Y-63349523D01*
X106322380Y-63016190D01*
X106370000Y-62920952D01*
X106417619Y-62873333D01*
X106512857Y-62825714D01*
X106608095Y-62825714D01*
X106703333Y-62873333D01*
X106750952Y-62920952D01*
X106798571Y-63016190D01*
X106798571Y-63349523D01*
X103231904Y-66630476D02*
X102431904Y-66630476D01*
X102431904Y-66440000D01*
X102470000Y-66325714D01*
X102546190Y-66249523D01*
X102622380Y-66211428D01*
X102774761Y-66173333D01*
X102889047Y-66173333D01*
X103041428Y-66211428D01*
X103117619Y-66249523D01*
X103193809Y-66325714D01*
X103231904Y-66440000D01*
X103231904Y-66630476D01*
X102698571Y-65487619D02*
X103231904Y-65487619D01*
X102393809Y-65678095D02*
X102965238Y-65868571D01*
X102965238Y-65373333D01*
G04 #@! TD*
M02*
