G04 #@! TF.GenerationSoftware,KiCad,Pcbnew,(5.0.0-3-g5ebb6b6)*
G04 #@! TF.CreationDate,2019-01-31T10:49:28+01:00*
G04 #@! TF.ProjectId,microbadge,6D6963726F62616467652E6B69636164,rev?*
G04 #@! TF.SameCoordinates,Original*
G04 #@! TF.FileFunction,Soldermask,Bot*
G04 #@! TF.FilePolarity,Negative*
%FSLAX46Y46*%
G04 Gerber Fmt 4.6, Leading zero omitted, Abs format (unit mm)*
G04 Created by KiCad (PCBNEW (5.0.0-3-g5ebb6b6)) date Thursday, 31. January 2019 um 10:49:28*
%MOMM*%
%LPD*%
G01*
G04 APERTURE LIST*
%ADD10O,1.450000X1.900000*%
%ADD11R,1.450000X1.900000*%
%ADD12C,0.100000*%
%ADD13C,1.550000*%
%ADD14C,1.350000*%
%ADD15R,3.200000X3.000000*%
%ADD16C,2.100000*%
%ADD17R,3.200000X2.600000*%
%ADD18R,3.200000X3.200000*%
%ADD19C,1.898000*%
%ADD20C,1.300000*%
%ADD21R,1.100000X1.900000*%
%ADD22R,1.400000X1.200000*%
%ADD23R,5.480000X2.940000*%
%ADD24C,18.180000*%
%ADD25R,2.000000X2.000000*%
%ADD26O,2.000000X2.000000*%
G04 APERTURE END LIST*
D10*
G04 #@! TO.C,U3*
X146350000Y-71120000D03*
X147620000Y-71120000D03*
D11*
X145080000Y-71120000D03*
G04 #@! TD*
D12*
G04 #@! TO.C,C1*
G36*
X127596071Y-54616623D02*
X127628781Y-54621475D01*
X127660857Y-54629509D01*
X127691991Y-54640649D01*
X127721884Y-54654787D01*
X127750247Y-54671787D01*
X127776807Y-54691485D01*
X127801308Y-54713692D01*
X127823515Y-54738193D01*
X127843213Y-54764753D01*
X127860213Y-54793116D01*
X127874351Y-54823009D01*
X127885491Y-54854143D01*
X127893525Y-54886219D01*
X127898377Y-54918929D01*
X127900000Y-54951956D01*
X127900000Y-55828044D01*
X127898377Y-55861071D01*
X127893525Y-55893781D01*
X127885491Y-55925857D01*
X127874351Y-55956991D01*
X127860213Y-55986884D01*
X127843213Y-56015247D01*
X127823515Y-56041807D01*
X127801308Y-56066308D01*
X127776807Y-56088515D01*
X127750247Y-56108213D01*
X127721884Y-56125213D01*
X127691991Y-56139351D01*
X127660857Y-56150491D01*
X127628781Y-56158525D01*
X127596071Y-56163377D01*
X127563044Y-56165000D01*
X126436956Y-56165000D01*
X126403929Y-56163377D01*
X126371219Y-56158525D01*
X126339143Y-56150491D01*
X126308009Y-56139351D01*
X126278116Y-56125213D01*
X126249753Y-56108213D01*
X126223193Y-56088515D01*
X126198692Y-56066308D01*
X126176485Y-56041807D01*
X126156787Y-56015247D01*
X126139787Y-55986884D01*
X126125649Y-55956991D01*
X126114509Y-55925857D01*
X126106475Y-55893781D01*
X126101623Y-55861071D01*
X126100000Y-55828044D01*
X126100000Y-54951956D01*
X126101623Y-54918929D01*
X126106475Y-54886219D01*
X126114509Y-54854143D01*
X126125649Y-54823009D01*
X126139787Y-54793116D01*
X126156787Y-54764753D01*
X126176485Y-54738193D01*
X126198692Y-54713692D01*
X126223193Y-54691485D01*
X126249753Y-54671787D01*
X126278116Y-54654787D01*
X126308009Y-54640649D01*
X126339143Y-54629509D01*
X126371219Y-54621475D01*
X126403929Y-54616623D01*
X126436956Y-54615000D01*
X127563044Y-54615000D01*
X127596071Y-54616623D01*
X127596071Y-54616623D01*
G37*
D13*
X127000000Y-55390000D03*
D12*
G36*
X127596071Y-52566623D02*
X127628781Y-52571475D01*
X127660857Y-52579509D01*
X127691991Y-52590649D01*
X127721884Y-52604787D01*
X127750247Y-52621787D01*
X127776807Y-52641485D01*
X127801308Y-52663692D01*
X127823515Y-52688193D01*
X127843213Y-52714753D01*
X127860213Y-52743116D01*
X127874351Y-52773009D01*
X127885491Y-52804143D01*
X127893525Y-52836219D01*
X127898377Y-52868929D01*
X127900000Y-52901956D01*
X127900000Y-53778044D01*
X127898377Y-53811071D01*
X127893525Y-53843781D01*
X127885491Y-53875857D01*
X127874351Y-53906991D01*
X127860213Y-53936884D01*
X127843213Y-53965247D01*
X127823515Y-53991807D01*
X127801308Y-54016308D01*
X127776807Y-54038515D01*
X127750247Y-54058213D01*
X127721884Y-54075213D01*
X127691991Y-54089351D01*
X127660857Y-54100491D01*
X127628781Y-54108525D01*
X127596071Y-54113377D01*
X127563044Y-54115000D01*
X126436956Y-54115000D01*
X126403929Y-54113377D01*
X126371219Y-54108525D01*
X126339143Y-54100491D01*
X126308009Y-54089351D01*
X126278116Y-54075213D01*
X126249753Y-54058213D01*
X126223193Y-54038515D01*
X126198692Y-54016308D01*
X126176485Y-53991807D01*
X126156787Y-53965247D01*
X126139787Y-53936884D01*
X126125649Y-53906991D01*
X126114509Y-53875857D01*
X126106475Y-53843781D01*
X126101623Y-53811071D01*
X126100000Y-53778044D01*
X126100000Y-52901956D01*
X126101623Y-52868929D01*
X126106475Y-52836219D01*
X126114509Y-52804143D01*
X126125649Y-52773009D01*
X126139787Y-52743116D01*
X126156787Y-52714753D01*
X126176485Y-52688193D01*
X126198692Y-52663692D01*
X126223193Y-52641485D01*
X126249753Y-52621787D01*
X126278116Y-52604787D01*
X126308009Y-52590649D01*
X126339143Y-52579509D01*
X126371219Y-52571475D01*
X126403929Y-52566623D01*
X126436956Y-52565000D01*
X127563044Y-52565000D01*
X127596071Y-52566623D01*
X127596071Y-52566623D01*
G37*
D13*
X127000000Y-53340000D03*
G04 #@! TD*
D12*
G04 #@! TO.C,C2*
G36*
X177001071Y-53711623D02*
X177033781Y-53716475D01*
X177065857Y-53724509D01*
X177096991Y-53735649D01*
X177126884Y-53749787D01*
X177155247Y-53766787D01*
X177181807Y-53786485D01*
X177206308Y-53808692D01*
X177228515Y-53833193D01*
X177248213Y-53859753D01*
X177265213Y-53888116D01*
X177279351Y-53918009D01*
X177290491Y-53949143D01*
X177298525Y-53981219D01*
X177303377Y-54013929D01*
X177305000Y-54046956D01*
X177305000Y-55173044D01*
X177303377Y-55206071D01*
X177298525Y-55238781D01*
X177290491Y-55270857D01*
X177279351Y-55301991D01*
X177265213Y-55331884D01*
X177248213Y-55360247D01*
X177228515Y-55386807D01*
X177206308Y-55411308D01*
X177181807Y-55433515D01*
X177155247Y-55453213D01*
X177126884Y-55470213D01*
X177096991Y-55484351D01*
X177065857Y-55495491D01*
X177033781Y-55503525D01*
X177001071Y-55508377D01*
X176968044Y-55510000D01*
X176091956Y-55510000D01*
X176058929Y-55508377D01*
X176026219Y-55503525D01*
X175994143Y-55495491D01*
X175963009Y-55484351D01*
X175933116Y-55470213D01*
X175904753Y-55453213D01*
X175878193Y-55433515D01*
X175853692Y-55411308D01*
X175831485Y-55386807D01*
X175811787Y-55360247D01*
X175794787Y-55331884D01*
X175780649Y-55301991D01*
X175769509Y-55270857D01*
X175761475Y-55238781D01*
X175756623Y-55206071D01*
X175755000Y-55173044D01*
X175755000Y-54046956D01*
X175756623Y-54013929D01*
X175761475Y-53981219D01*
X175769509Y-53949143D01*
X175780649Y-53918009D01*
X175794787Y-53888116D01*
X175811787Y-53859753D01*
X175831485Y-53833193D01*
X175853692Y-53808692D01*
X175878193Y-53786485D01*
X175904753Y-53766787D01*
X175933116Y-53749787D01*
X175963009Y-53735649D01*
X175994143Y-53724509D01*
X176026219Y-53716475D01*
X176058929Y-53711623D01*
X176091956Y-53710000D01*
X176968044Y-53710000D01*
X177001071Y-53711623D01*
X177001071Y-53711623D01*
G37*
D13*
X176530000Y-54610000D03*
D12*
G36*
X174951071Y-53711623D02*
X174983781Y-53716475D01*
X175015857Y-53724509D01*
X175046991Y-53735649D01*
X175076884Y-53749787D01*
X175105247Y-53766787D01*
X175131807Y-53786485D01*
X175156308Y-53808692D01*
X175178515Y-53833193D01*
X175198213Y-53859753D01*
X175215213Y-53888116D01*
X175229351Y-53918009D01*
X175240491Y-53949143D01*
X175248525Y-53981219D01*
X175253377Y-54013929D01*
X175255000Y-54046956D01*
X175255000Y-55173044D01*
X175253377Y-55206071D01*
X175248525Y-55238781D01*
X175240491Y-55270857D01*
X175229351Y-55301991D01*
X175215213Y-55331884D01*
X175198213Y-55360247D01*
X175178515Y-55386807D01*
X175156308Y-55411308D01*
X175131807Y-55433515D01*
X175105247Y-55453213D01*
X175076884Y-55470213D01*
X175046991Y-55484351D01*
X175015857Y-55495491D01*
X174983781Y-55503525D01*
X174951071Y-55508377D01*
X174918044Y-55510000D01*
X174041956Y-55510000D01*
X174008929Y-55508377D01*
X173976219Y-55503525D01*
X173944143Y-55495491D01*
X173913009Y-55484351D01*
X173883116Y-55470213D01*
X173854753Y-55453213D01*
X173828193Y-55433515D01*
X173803692Y-55411308D01*
X173781485Y-55386807D01*
X173761787Y-55360247D01*
X173744787Y-55331884D01*
X173730649Y-55301991D01*
X173719509Y-55270857D01*
X173711475Y-55238781D01*
X173706623Y-55206071D01*
X173705000Y-55173044D01*
X173705000Y-54046956D01*
X173706623Y-54013929D01*
X173711475Y-53981219D01*
X173719509Y-53949143D01*
X173730649Y-53918009D01*
X173744787Y-53888116D01*
X173761787Y-53859753D01*
X173781485Y-53833193D01*
X173803692Y-53808692D01*
X173828193Y-53786485D01*
X173854753Y-53766787D01*
X173883116Y-53749787D01*
X173913009Y-53735649D01*
X173944143Y-53724509D01*
X173976219Y-53716475D01*
X174008929Y-53711623D01*
X174041956Y-53710000D01*
X174918044Y-53710000D01*
X174951071Y-53711623D01*
X174951071Y-53711623D01*
G37*
D13*
X174480000Y-54610000D03*
G04 #@! TD*
D12*
G04 #@! TO.C,D9*
G36*
X179440581Y-56821625D02*
X179473343Y-56826485D01*
X179505471Y-56834533D01*
X179536656Y-56845691D01*
X179566596Y-56859852D01*
X179595005Y-56876879D01*
X179621608Y-56896609D01*
X179646149Y-56918851D01*
X179668391Y-56943392D01*
X179688121Y-56969995D01*
X179705148Y-56998404D01*
X179719309Y-57028344D01*
X179730467Y-57059529D01*
X179738515Y-57091657D01*
X179743375Y-57124419D01*
X179745000Y-57157500D01*
X179745000Y-57932500D01*
X179743375Y-57965581D01*
X179738515Y-57998343D01*
X179730467Y-58030471D01*
X179719309Y-58061656D01*
X179705148Y-58091596D01*
X179688121Y-58120005D01*
X179668391Y-58146608D01*
X179646149Y-58171149D01*
X179621608Y-58193391D01*
X179595005Y-58213121D01*
X179566596Y-58230148D01*
X179536656Y-58244309D01*
X179505471Y-58255467D01*
X179473343Y-58263515D01*
X179440581Y-58268375D01*
X179407500Y-58270000D01*
X178732500Y-58270000D01*
X178699419Y-58268375D01*
X178666657Y-58263515D01*
X178634529Y-58255467D01*
X178603344Y-58244309D01*
X178573404Y-58230148D01*
X178544995Y-58213121D01*
X178518392Y-58193391D01*
X178493851Y-58171149D01*
X178471609Y-58146608D01*
X178451879Y-58120005D01*
X178434852Y-58091596D01*
X178420691Y-58061656D01*
X178409533Y-58030471D01*
X178401485Y-57998343D01*
X178396625Y-57965581D01*
X178395000Y-57932500D01*
X178395000Y-57157500D01*
X178396625Y-57124419D01*
X178401485Y-57091657D01*
X178409533Y-57059529D01*
X178420691Y-57028344D01*
X178434852Y-56998404D01*
X178451879Y-56969995D01*
X178471609Y-56943392D01*
X178493851Y-56918851D01*
X178518392Y-56896609D01*
X178544995Y-56876879D01*
X178573404Y-56859852D01*
X178603344Y-56845691D01*
X178634529Y-56834533D01*
X178666657Y-56826485D01*
X178699419Y-56821625D01*
X178732500Y-56820000D01*
X179407500Y-56820000D01*
X179440581Y-56821625D01*
X179440581Y-56821625D01*
G37*
D14*
X179070000Y-57545000D03*
D12*
G36*
X179440581Y-58571625D02*
X179473343Y-58576485D01*
X179505471Y-58584533D01*
X179536656Y-58595691D01*
X179566596Y-58609852D01*
X179595005Y-58626879D01*
X179621608Y-58646609D01*
X179646149Y-58668851D01*
X179668391Y-58693392D01*
X179688121Y-58719995D01*
X179705148Y-58748404D01*
X179719309Y-58778344D01*
X179730467Y-58809529D01*
X179738515Y-58841657D01*
X179743375Y-58874419D01*
X179745000Y-58907500D01*
X179745000Y-59682500D01*
X179743375Y-59715581D01*
X179738515Y-59748343D01*
X179730467Y-59780471D01*
X179719309Y-59811656D01*
X179705148Y-59841596D01*
X179688121Y-59870005D01*
X179668391Y-59896608D01*
X179646149Y-59921149D01*
X179621608Y-59943391D01*
X179595005Y-59963121D01*
X179566596Y-59980148D01*
X179536656Y-59994309D01*
X179505471Y-60005467D01*
X179473343Y-60013515D01*
X179440581Y-60018375D01*
X179407500Y-60020000D01*
X178732500Y-60020000D01*
X178699419Y-60018375D01*
X178666657Y-60013515D01*
X178634529Y-60005467D01*
X178603344Y-59994309D01*
X178573404Y-59980148D01*
X178544995Y-59963121D01*
X178518392Y-59943391D01*
X178493851Y-59921149D01*
X178471609Y-59896608D01*
X178451879Y-59870005D01*
X178434852Y-59841596D01*
X178420691Y-59811656D01*
X178409533Y-59780471D01*
X178401485Y-59748343D01*
X178396625Y-59715581D01*
X178395000Y-59682500D01*
X178395000Y-58907500D01*
X178396625Y-58874419D01*
X178401485Y-58841657D01*
X178409533Y-58809529D01*
X178420691Y-58778344D01*
X178434852Y-58748404D01*
X178451879Y-58719995D01*
X178471609Y-58693392D01*
X178493851Y-58668851D01*
X178518392Y-58646609D01*
X178544995Y-58626879D01*
X178573404Y-58609852D01*
X178603344Y-58595691D01*
X178634529Y-58584533D01*
X178666657Y-58576485D01*
X178699419Y-58571625D01*
X178732500Y-58570000D01*
X179407500Y-58570000D01*
X179440581Y-58571625D01*
X179440581Y-58571625D01*
G37*
D14*
X179070000Y-59295000D03*
G04 #@! TD*
D15*
G04 #@! TO.C,J1*
X171970000Y-49130000D03*
D16*
X172720000Y-36830000D03*
D17*
X169020000Y-37730000D03*
X176420000Y-35730000D03*
D18*
X176420000Y-45130000D03*
D16*
X172720000Y-43830000D03*
G04 #@! TD*
D12*
G04 #@! TO.C,R1*
G36*
X174706071Y-76571623D02*
X174738781Y-76576475D01*
X174770857Y-76584509D01*
X174801991Y-76595649D01*
X174831884Y-76609787D01*
X174860247Y-76626787D01*
X174886807Y-76646485D01*
X174911308Y-76668692D01*
X174933515Y-76693193D01*
X174953213Y-76719753D01*
X174970213Y-76748116D01*
X174984351Y-76778009D01*
X174995491Y-76809143D01*
X175003525Y-76841219D01*
X175008377Y-76873929D01*
X175010000Y-76906956D01*
X175010000Y-78033044D01*
X175008377Y-78066071D01*
X175003525Y-78098781D01*
X174995491Y-78130857D01*
X174984351Y-78161991D01*
X174970213Y-78191884D01*
X174953213Y-78220247D01*
X174933515Y-78246807D01*
X174911308Y-78271308D01*
X174886807Y-78293515D01*
X174860247Y-78313213D01*
X174831884Y-78330213D01*
X174801991Y-78344351D01*
X174770857Y-78355491D01*
X174738781Y-78363525D01*
X174706071Y-78368377D01*
X174673044Y-78370000D01*
X173796956Y-78370000D01*
X173763929Y-78368377D01*
X173731219Y-78363525D01*
X173699143Y-78355491D01*
X173668009Y-78344351D01*
X173638116Y-78330213D01*
X173609753Y-78313213D01*
X173583193Y-78293515D01*
X173558692Y-78271308D01*
X173536485Y-78246807D01*
X173516787Y-78220247D01*
X173499787Y-78191884D01*
X173485649Y-78161991D01*
X173474509Y-78130857D01*
X173466475Y-78098781D01*
X173461623Y-78066071D01*
X173460000Y-78033044D01*
X173460000Y-76906956D01*
X173461623Y-76873929D01*
X173466475Y-76841219D01*
X173474509Y-76809143D01*
X173485649Y-76778009D01*
X173499787Y-76748116D01*
X173516787Y-76719753D01*
X173536485Y-76693193D01*
X173558692Y-76668692D01*
X173583193Y-76646485D01*
X173609753Y-76626787D01*
X173638116Y-76609787D01*
X173668009Y-76595649D01*
X173699143Y-76584509D01*
X173731219Y-76576475D01*
X173763929Y-76571623D01*
X173796956Y-76570000D01*
X174673044Y-76570000D01*
X174706071Y-76571623D01*
X174706071Y-76571623D01*
G37*
D13*
X174235000Y-77470000D03*
D12*
G36*
X176756071Y-76571623D02*
X176788781Y-76576475D01*
X176820857Y-76584509D01*
X176851991Y-76595649D01*
X176881884Y-76609787D01*
X176910247Y-76626787D01*
X176936807Y-76646485D01*
X176961308Y-76668692D01*
X176983515Y-76693193D01*
X177003213Y-76719753D01*
X177020213Y-76748116D01*
X177034351Y-76778009D01*
X177045491Y-76809143D01*
X177053525Y-76841219D01*
X177058377Y-76873929D01*
X177060000Y-76906956D01*
X177060000Y-78033044D01*
X177058377Y-78066071D01*
X177053525Y-78098781D01*
X177045491Y-78130857D01*
X177034351Y-78161991D01*
X177020213Y-78191884D01*
X177003213Y-78220247D01*
X176983515Y-78246807D01*
X176961308Y-78271308D01*
X176936807Y-78293515D01*
X176910247Y-78313213D01*
X176881884Y-78330213D01*
X176851991Y-78344351D01*
X176820857Y-78355491D01*
X176788781Y-78363525D01*
X176756071Y-78368377D01*
X176723044Y-78370000D01*
X175846956Y-78370000D01*
X175813929Y-78368377D01*
X175781219Y-78363525D01*
X175749143Y-78355491D01*
X175718009Y-78344351D01*
X175688116Y-78330213D01*
X175659753Y-78313213D01*
X175633193Y-78293515D01*
X175608692Y-78271308D01*
X175586485Y-78246807D01*
X175566787Y-78220247D01*
X175549787Y-78191884D01*
X175535649Y-78161991D01*
X175524509Y-78130857D01*
X175516475Y-78098781D01*
X175511623Y-78066071D01*
X175510000Y-78033044D01*
X175510000Y-76906956D01*
X175511623Y-76873929D01*
X175516475Y-76841219D01*
X175524509Y-76809143D01*
X175535649Y-76778009D01*
X175549787Y-76748116D01*
X175566787Y-76719753D01*
X175586485Y-76693193D01*
X175608692Y-76668692D01*
X175633193Y-76646485D01*
X175659753Y-76626787D01*
X175688116Y-76609787D01*
X175718009Y-76595649D01*
X175749143Y-76584509D01*
X175781219Y-76576475D01*
X175813929Y-76571623D01*
X175846956Y-76570000D01*
X176723044Y-76570000D01*
X176756071Y-76571623D01*
X176756071Y-76571623D01*
G37*
D13*
X176285000Y-77470000D03*
G04 #@! TD*
D12*
G04 #@! TO.C,R2*
G36*
X193756071Y-77841623D02*
X193788781Y-77846475D01*
X193820857Y-77854509D01*
X193851991Y-77865649D01*
X193881884Y-77879787D01*
X193910247Y-77896787D01*
X193936807Y-77916485D01*
X193961308Y-77938692D01*
X193983515Y-77963193D01*
X194003213Y-77989753D01*
X194020213Y-78018116D01*
X194034351Y-78048009D01*
X194045491Y-78079143D01*
X194053525Y-78111219D01*
X194058377Y-78143929D01*
X194060000Y-78176956D01*
X194060000Y-79303044D01*
X194058377Y-79336071D01*
X194053525Y-79368781D01*
X194045491Y-79400857D01*
X194034351Y-79431991D01*
X194020213Y-79461884D01*
X194003213Y-79490247D01*
X193983515Y-79516807D01*
X193961308Y-79541308D01*
X193936807Y-79563515D01*
X193910247Y-79583213D01*
X193881884Y-79600213D01*
X193851991Y-79614351D01*
X193820857Y-79625491D01*
X193788781Y-79633525D01*
X193756071Y-79638377D01*
X193723044Y-79640000D01*
X192846956Y-79640000D01*
X192813929Y-79638377D01*
X192781219Y-79633525D01*
X192749143Y-79625491D01*
X192718009Y-79614351D01*
X192688116Y-79600213D01*
X192659753Y-79583213D01*
X192633193Y-79563515D01*
X192608692Y-79541308D01*
X192586485Y-79516807D01*
X192566787Y-79490247D01*
X192549787Y-79461884D01*
X192535649Y-79431991D01*
X192524509Y-79400857D01*
X192516475Y-79368781D01*
X192511623Y-79336071D01*
X192510000Y-79303044D01*
X192510000Y-78176956D01*
X192511623Y-78143929D01*
X192516475Y-78111219D01*
X192524509Y-78079143D01*
X192535649Y-78048009D01*
X192549787Y-78018116D01*
X192566787Y-77989753D01*
X192586485Y-77963193D01*
X192608692Y-77938692D01*
X192633193Y-77916485D01*
X192659753Y-77896787D01*
X192688116Y-77879787D01*
X192718009Y-77865649D01*
X192749143Y-77854509D01*
X192781219Y-77846475D01*
X192813929Y-77841623D01*
X192846956Y-77840000D01*
X193723044Y-77840000D01*
X193756071Y-77841623D01*
X193756071Y-77841623D01*
G37*
D13*
X193285000Y-78740000D03*
D12*
G36*
X195806071Y-77841623D02*
X195838781Y-77846475D01*
X195870857Y-77854509D01*
X195901991Y-77865649D01*
X195931884Y-77879787D01*
X195960247Y-77896787D01*
X195986807Y-77916485D01*
X196011308Y-77938692D01*
X196033515Y-77963193D01*
X196053213Y-77989753D01*
X196070213Y-78018116D01*
X196084351Y-78048009D01*
X196095491Y-78079143D01*
X196103525Y-78111219D01*
X196108377Y-78143929D01*
X196110000Y-78176956D01*
X196110000Y-79303044D01*
X196108377Y-79336071D01*
X196103525Y-79368781D01*
X196095491Y-79400857D01*
X196084351Y-79431991D01*
X196070213Y-79461884D01*
X196053213Y-79490247D01*
X196033515Y-79516807D01*
X196011308Y-79541308D01*
X195986807Y-79563515D01*
X195960247Y-79583213D01*
X195931884Y-79600213D01*
X195901991Y-79614351D01*
X195870857Y-79625491D01*
X195838781Y-79633525D01*
X195806071Y-79638377D01*
X195773044Y-79640000D01*
X194896956Y-79640000D01*
X194863929Y-79638377D01*
X194831219Y-79633525D01*
X194799143Y-79625491D01*
X194768009Y-79614351D01*
X194738116Y-79600213D01*
X194709753Y-79583213D01*
X194683193Y-79563515D01*
X194658692Y-79541308D01*
X194636485Y-79516807D01*
X194616787Y-79490247D01*
X194599787Y-79461884D01*
X194585649Y-79431991D01*
X194574509Y-79400857D01*
X194566475Y-79368781D01*
X194561623Y-79336071D01*
X194560000Y-79303044D01*
X194560000Y-78176956D01*
X194561623Y-78143929D01*
X194566475Y-78111219D01*
X194574509Y-78079143D01*
X194585649Y-78048009D01*
X194599787Y-78018116D01*
X194616787Y-77989753D01*
X194636485Y-77963193D01*
X194658692Y-77938692D01*
X194683193Y-77916485D01*
X194709753Y-77896787D01*
X194738116Y-77879787D01*
X194768009Y-77865649D01*
X194799143Y-77854509D01*
X194831219Y-77846475D01*
X194863929Y-77841623D01*
X194896956Y-77840000D01*
X195773044Y-77840000D01*
X195806071Y-77841623D01*
X195806071Y-77841623D01*
G37*
D13*
X195335000Y-78740000D03*
G04 #@! TD*
D12*
G04 #@! TO.C,R3*
G36*
X176756071Y-72761623D02*
X176788781Y-72766475D01*
X176820857Y-72774509D01*
X176851991Y-72785649D01*
X176881884Y-72799787D01*
X176910247Y-72816787D01*
X176936807Y-72836485D01*
X176961308Y-72858692D01*
X176983515Y-72883193D01*
X177003213Y-72909753D01*
X177020213Y-72938116D01*
X177034351Y-72968009D01*
X177045491Y-72999143D01*
X177053525Y-73031219D01*
X177058377Y-73063929D01*
X177060000Y-73096956D01*
X177060000Y-74223044D01*
X177058377Y-74256071D01*
X177053525Y-74288781D01*
X177045491Y-74320857D01*
X177034351Y-74351991D01*
X177020213Y-74381884D01*
X177003213Y-74410247D01*
X176983515Y-74436807D01*
X176961308Y-74461308D01*
X176936807Y-74483515D01*
X176910247Y-74503213D01*
X176881884Y-74520213D01*
X176851991Y-74534351D01*
X176820857Y-74545491D01*
X176788781Y-74553525D01*
X176756071Y-74558377D01*
X176723044Y-74560000D01*
X175846956Y-74560000D01*
X175813929Y-74558377D01*
X175781219Y-74553525D01*
X175749143Y-74545491D01*
X175718009Y-74534351D01*
X175688116Y-74520213D01*
X175659753Y-74503213D01*
X175633193Y-74483515D01*
X175608692Y-74461308D01*
X175586485Y-74436807D01*
X175566787Y-74410247D01*
X175549787Y-74381884D01*
X175535649Y-74351991D01*
X175524509Y-74320857D01*
X175516475Y-74288781D01*
X175511623Y-74256071D01*
X175510000Y-74223044D01*
X175510000Y-73096956D01*
X175511623Y-73063929D01*
X175516475Y-73031219D01*
X175524509Y-72999143D01*
X175535649Y-72968009D01*
X175549787Y-72938116D01*
X175566787Y-72909753D01*
X175586485Y-72883193D01*
X175608692Y-72858692D01*
X175633193Y-72836485D01*
X175659753Y-72816787D01*
X175688116Y-72799787D01*
X175718009Y-72785649D01*
X175749143Y-72774509D01*
X175781219Y-72766475D01*
X175813929Y-72761623D01*
X175846956Y-72760000D01*
X176723044Y-72760000D01*
X176756071Y-72761623D01*
X176756071Y-72761623D01*
G37*
D13*
X176285000Y-73660000D03*
D12*
G36*
X174706071Y-72761623D02*
X174738781Y-72766475D01*
X174770857Y-72774509D01*
X174801991Y-72785649D01*
X174831884Y-72799787D01*
X174860247Y-72816787D01*
X174886807Y-72836485D01*
X174911308Y-72858692D01*
X174933515Y-72883193D01*
X174953213Y-72909753D01*
X174970213Y-72938116D01*
X174984351Y-72968009D01*
X174995491Y-72999143D01*
X175003525Y-73031219D01*
X175008377Y-73063929D01*
X175010000Y-73096956D01*
X175010000Y-74223044D01*
X175008377Y-74256071D01*
X175003525Y-74288781D01*
X174995491Y-74320857D01*
X174984351Y-74351991D01*
X174970213Y-74381884D01*
X174953213Y-74410247D01*
X174933515Y-74436807D01*
X174911308Y-74461308D01*
X174886807Y-74483515D01*
X174860247Y-74503213D01*
X174831884Y-74520213D01*
X174801991Y-74534351D01*
X174770857Y-74545491D01*
X174738781Y-74553525D01*
X174706071Y-74558377D01*
X174673044Y-74560000D01*
X173796956Y-74560000D01*
X173763929Y-74558377D01*
X173731219Y-74553525D01*
X173699143Y-74545491D01*
X173668009Y-74534351D01*
X173638116Y-74520213D01*
X173609753Y-74503213D01*
X173583193Y-74483515D01*
X173558692Y-74461308D01*
X173536485Y-74436807D01*
X173516787Y-74410247D01*
X173499787Y-74381884D01*
X173485649Y-74351991D01*
X173474509Y-74320857D01*
X173466475Y-74288781D01*
X173461623Y-74256071D01*
X173460000Y-74223044D01*
X173460000Y-73096956D01*
X173461623Y-73063929D01*
X173466475Y-73031219D01*
X173474509Y-72999143D01*
X173485649Y-72968009D01*
X173499787Y-72938116D01*
X173516787Y-72909753D01*
X173536485Y-72883193D01*
X173558692Y-72858692D01*
X173583193Y-72836485D01*
X173609753Y-72816787D01*
X173638116Y-72799787D01*
X173668009Y-72785649D01*
X173699143Y-72774509D01*
X173731219Y-72766475D01*
X173763929Y-72761623D01*
X173796956Y-72760000D01*
X174673044Y-72760000D01*
X174706071Y-72761623D01*
X174706071Y-72761623D01*
G37*
D13*
X174235000Y-73660000D03*
G04 #@! TD*
D12*
G04 #@! TO.C,R4*
G36*
X183476071Y-62481623D02*
X183508781Y-62486475D01*
X183540857Y-62494509D01*
X183571991Y-62505649D01*
X183601884Y-62519787D01*
X183630247Y-62536787D01*
X183656807Y-62556485D01*
X183681308Y-62578692D01*
X183703515Y-62603193D01*
X183723213Y-62629753D01*
X183740213Y-62658116D01*
X183754351Y-62688009D01*
X183765491Y-62719143D01*
X183773525Y-62751219D01*
X183778377Y-62783929D01*
X183780000Y-62816956D01*
X183780000Y-63693044D01*
X183778377Y-63726071D01*
X183773525Y-63758781D01*
X183765491Y-63790857D01*
X183754351Y-63821991D01*
X183740213Y-63851884D01*
X183723213Y-63880247D01*
X183703515Y-63906807D01*
X183681308Y-63931308D01*
X183656807Y-63953515D01*
X183630247Y-63973213D01*
X183601884Y-63990213D01*
X183571991Y-64004351D01*
X183540857Y-64015491D01*
X183508781Y-64023525D01*
X183476071Y-64028377D01*
X183443044Y-64030000D01*
X182316956Y-64030000D01*
X182283929Y-64028377D01*
X182251219Y-64023525D01*
X182219143Y-64015491D01*
X182188009Y-64004351D01*
X182158116Y-63990213D01*
X182129753Y-63973213D01*
X182103193Y-63953515D01*
X182078692Y-63931308D01*
X182056485Y-63906807D01*
X182036787Y-63880247D01*
X182019787Y-63851884D01*
X182005649Y-63821991D01*
X181994509Y-63790857D01*
X181986475Y-63758781D01*
X181981623Y-63726071D01*
X181980000Y-63693044D01*
X181980000Y-62816956D01*
X181981623Y-62783929D01*
X181986475Y-62751219D01*
X181994509Y-62719143D01*
X182005649Y-62688009D01*
X182019787Y-62658116D01*
X182036787Y-62629753D01*
X182056485Y-62603193D01*
X182078692Y-62578692D01*
X182103193Y-62556485D01*
X182129753Y-62536787D01*
X182158116Y-62519787D01*
X182188009Y-62505649D01*
X182219143Y-62494509D01*
X182251219Y-62486475D01*
X182283929Y-62481623D01*
X182316956Y-62480000D01*
X183443044Y-62480000D01*
X183476071Y-62481623D01*
X183476071Y-62481623D01*
G37*
D13*
X182880000Y-63255000D03*
D12*
G36*
X183476071Y-60431623D02*
X183508781Y-60436475D01*
X183540857Y-60444509D01*
X183571991Y-60455649D01*
X183601884Y-60469787D01*
X183630247Y-60486787D01*
X183656807Y-60506485D01*
X183681308Y-60528692D01*
X183703515Y-60553193D01*
X183723213Y-60579753D01*
X183740213Y-60608116D01*
X183754351Y-60638009D01*
X183765491Y-60669143D01*
X183773525Y-60701219D01*
X183778377Y-60733929D01*
X183780000Y-60766956D01*
X183780000Y-61643044D01*
X183778377Y-61676071D01*
X183773525Y-61708781D01*
X183765491Y-61740857D01*
X183754351Y-61771991D01*
X183740213Y-61801884D01*
X183723213Y-61830247D01*
X183703515Y-61856807D01*
X183681308Y-61881308D01*
X183656807Y-61903515D01*
X183630247Y-61923213D01*
X183601884Y-61940213D01*
X183571991Y-61954351D01*
X183540857Y-61965491D01*
X183508781Y-61973525D01*
X183476071Y-61978377D01*
X183443044Y-61980000D01*
X182316956Y-61980000D01*
X182283929Y-61978377D01*
X182251219Y-61973525D01*
X182219143Y-61965491D01*
X182188009Y-61954351D01*
X182158116Y-61940213D01*
X182129753Y-61923213D01*
X182103193Y-61903515D01*
X182078692Y-61881308D01*
X182056485Y-61856807D01*
X182036787Y-61830247D01*
X182019787Y-61801884D01*
X182005649Y-61771991D01*
X181994509Y-61740857D01*
X181986475Y-61708781D01*
X181981623Y-61676071D01*
X181980000Y-61643044D01*
X181980000Y-60766956D01*
X181981623Y-60733929D01*
X181986475Y-60701219D01*
X181994509Y-60669143D01*
X182005649Y-60638009D01*
X182019787Y-60608116D01*
X182036787Y-60579753D01*
X182056485Y-60553193D01*
X182078692Y-60528692D01*
X182103193Y-60506485D01*
X182129753Y-60486787D01*
X182158116Y-60469787D01*
X182188009Y-60455649D01*
X182219143Y-60444509D01*
X182251219Y-60436475D01*
X182283929Y-60431623D01*
X182316956Y-60430000D01*
X183443044Y-60430000D01*
X183476071Y-60431623D01*
X183476071Y-60431623D01*
G37*
D13*
X182880000Y-61205000D03*
G04 #@! TD*
D12*
G04 #@! TO.C,R5*
G36*
X186136071Y-85461623D02*
X186168781Y-85466475D01*
X186200857Y-85474509D01*
X186231991Y-85485649D01*
X186261884Y-85499787D01*
X186290247Y-85516787D01*
X186316807Y-85536485D01*
X186341308Y-85558692D01*
X186363515Y-85583193D01*
X186383213Y-85609753D01*
X186400213Y-85638116D01*
X186414351Y-85668009D01*
X186425491Y-85699143D01*
X186433525Y-85731219D01*
X186438377Y-85763929D01*
X186440000Y-85796956D01*
X186440000Y-86923044D01*
X186438377Y-86956071D01*
X186433525Y-86988781D01*
X186425491Y-87020857D01*
X186414351Y-87051991D01*
X186400213Y-87081884D01*
X186383213Y-87110247D01*
X186363515Y-87136807D01*
X186341308Y-87161308D01*
X186316807Y-87183515D01*
X186290247Y-87203213D01*
X186261884Y-87220213D01*
X186231991Y-87234351D01*
X186200857Y-87245491D01*
X186168781Y-87253525D01*
X186136071Y-87258377D01*
X186103044Y-87260000D01*
X185226956Y-87260000D01*
X185193929Y-87258377D01*
X185161219Y-87253525D01*
X185129143Y-87245491D01*
X185098009Y-87234351D01*
X185068116Y-87220213D01*
X185039753Y-87203213D01*
X185013193Y-87183515D01*
X184988692Y-87161308D01*
X184966485Y-87136807D01*
X184946787Y-87110247D01*
X184929787Y-87081884D01*
X184915649Y-87051991D01*
X184904509Y-87020857D01*
X184896475Y-86988781D01*
X184891623Y-86956071D01*
X184890000Y-86923044D01*
X184890000Y-85796956D01*
X184891623Y-85763929D01*
X184896475Y-85731219D01*
X184904509Y-85699143D01*
X184915649Y-85668009D01*
X184929787Y-85638116D01*
X184946787Y-85609753D01*
X184966485Y-85583193D01*
X184988692Y-85558692D01*
X185013193Y-85536485D01*
X185039753Y-85516787D01*
X185068116Y-85499787D01*
X185098009Y-85485649D01*
X185129143Y-85474509D01*
X185161219Y-85466475D01*
X185193929Y-85461623D01*
X185226956Y-85460000D01*
X186103044Y-85460000D01*
X186136071Y-85461623D01*
X186136071Y-85461623D01*
G37*
D13*
X185665000Y-86360000D03*
D12*
G36*
X188186071Y-85461623D02*
X188218781Y-85466475D01*
X188250857Y-85474509D01*
X188281991Y-85485649D01*
X188311884Y-85499787D01*
X188340247Y-85516787D01*
X188366807Y-85536485D01*
X188391308Y-85558692D01*
X188413515Y-85583193D01*
X188433213Y-85609753D01*
X188450213Y-85638116D01*
X188464351Y-85668009D01*
X188475491Y-85699143D01*
X188483525Y-85731219D01*
X188488377Y-85763929D01*
X188490000Y-85796956D01*
X188490000Y-86923044D01*
X188488377Y-86956071D01*
X188483525Y-86988781D01*
X188475491Y-87020857D01*
X188464351Y-87051991D01*
X188450213Y-87081884D01*
X188433213Y-87110247D01*
X188413515Y-87136807D01*
X188391308Y-87161308D01*
X188366807Y-87183515D01*
X188340247Y-87203213D01*
X188311884Y-87220213D01*
X188281991Y-87234351D01*
X188250857Y-87245491D01*
X188218781Y-87253525D01*
X188186071Y-87258377D01*
X188153044Y-87260000D01*
X187276956Y-87260000D01*
X187243929Y-87258377D01*
X187211219Y-87253525D01*
X187179143Y-87245491D01*
X187148009Y-87234351D01*
X187118116Y-87220213D01*
X187089753Y-87203213D01*
X187063193Y-87183515D01*
X187038692Y-87161308D01*
X187016485Y-87136807D01*
X186996787Y-87110247D01*
X186979787Y-87081884D01*
X186965649Y-87051991D01*
X186954509Y-87020857D01*
X186946475Y-86988781D01*
X186941623Y-86956071D01*
X186940000Y-86923044D01*
X186940000Y-85796956D01*
X186941623Y-85763929D01*
X186946475Y-85731219D01*
X186954509Y-85699143D01*
X186965649Y-85668009D01*
X186979787Y-85638116D01*
X186996787Y-85609753D01*
X187016485Y-85583193D01*
X187038692Y-85558692D01*
X187063193Y-85536485D01*
X187089753Y-85516787D01*
X187118116Y-85499787D01*
X187148009Y-85485649D01*
X187179143Y-85474509D01*
X187211219Y-85466475D01*
X187243929Y-85461623D01*
X187276956Y-85460000D01*
X188153044Y-85460000D01*
X188186071Y-85461623D01*
X188186071Y-85461623D01*
G37*
D13*
X187715000Y-86360000D03*
G04 #@! TD*
D12*
G04 #@! TO.C,R6*
G36*
X188186071Y-81651623D02*
X188218781Y-81656475D01*
X188250857Y-81664509D01*
X188281991Y-81675649D01*
X188311884Y-81689787D01*
X188340247Y-81706787D01*
X188366807Y-81726485D01*
X188391308Y-81748692D01*
X188413515Y-81773193D01*
X188433213Y-81799753D01*
X188450213Y-81828116D01*
X188464351Y-81858009D01*
X188475491Y-81889143D01*
X188483525Y-81921219D01*
X188488377Y-81953929D01*
X188490000Y-81986956D01*
X188490000Y-83113044D01*
X188488377Y-83146071D01*
X188483525Y-83178781D01*
X188475491Y-83210857D01*
X188464351Y-83241991D01*
X188450213Y-83271884D01*
X188433213Y-83300247D01*
X188413515Y-83326807D01*
X188391308Y-83351308D01*
X188366807Y-83373515D01*
X188340247Y-83393213D01*
X188311884Y-83410213D01*
X188281991Y-83424351D01*
X188250857Y-83435491D01*
X188218781Y-83443525D01*
X188186071Y-83448377D01*
X188153044Y-83450000D01*
X187276956Y-83450000D01*
X187243929Y-83448377D01*
X187211219Y-83443525D01*
X187179143Y-83435491D01*
X187148009Y-83424351D01*
X187118116Y-83410213D01*
X187089753Y-83393213D01*
X187063193Y-83373515D01*
X187038692Y-83351308D01*
X187016485Y-83326807D01*
X186996787Y-83300247D01*
X186979787Y-83271884D01*
X186965649Y-83241991D01*
X186954509Y-83210857D01*
X186946475Y-83178781D01*
X186941623Y-83146071D01*
X186940000Y-83113044D01*
X186940000Y-81986956D01*
X186941623Y-81953929D01*
X186946475Y-81921219D01*
X186954509Y-81889143D01*
X186965649Y-81858009D01*
X186979787Y-81828116D01*
X186996787Y-81799753D01*
X187016485Y-81773193D01*
X187038692Y-81748692D01*
X187063193Y-81726485D01*
X187089753Y-81706787D01*
X187118116Y-81689787D01*
X187148009Y-81675649D01*
X187179143Y-81664509D01*
X187211219Y-81656475D01*
X187243929Y-81651623D01*
X187276956Y-81650000D01*
X188153044Y-81650000D01*
X188186071Y-81651623D01*
X188186071Y-81651623D01*
G37*
D13*
X187715000Y-82550000D03*
D12*
G36*
X186136071Y-81651623D02*
X186168781Y-81656475D01*
X186200857Y-81664509D01*
X186231991Y-81675649D01*
X186261884Y-81689787D01*
X186290247Y-81706787D01*
X186316807Y-81726485D01*
X186341308Y-81748692D01*
X186363515Y-81773193D01*
X186383213Y-81799753D01*
X186400213Y-81828116D01*
X186414351Y-81858009D01*
X186425491Y-81889143D01*
X186433525Y-81921219D01*
X186438377Y-81953929D01*
X186440000Y-81986956D01*
X186440000Y-83113044D01*
X186438377Y-83146071D01*
X186433525Y-83178781D01*
X186425491Y-83210857D01*
X186414351Y-83241991D01*
X186400213Y-83271884D01*
X186383213Y-83300247D01*
X186363515Y-83326807D01*
X186341308Y-83351308D01*
X186316807Y-83373515D01*
X186290247Y-83393213D01*
X186261884Y-83410213D01*
X186231991Y-83424351D01*
X186200857Y-83435491D01*
X186168781Y-83443525D01*
X186136071Y-83448377D01*
X186103044Y-83450000D01*
X185226956Y-83450000D01*
X185193929Y-83448377D01*
X185161219Y-83443525D01*
X185129143Y-83435491D01*
X185098009Y-83424351D01*
X185068116Y-83410213D01*
X185039753Y-83393213D01*
X185013193Y-83373515D01*
X184988692Y-83351308D01*
X184966485Y-83326807D01*
X184946787Y-83300247D01*
X184929787Y-83271884D01*
X184915649Y-83241991D01*
X184904509Y-83210857D01*
X184896475Y-83178781D01*
X184891623Y-83146071D01*
X184890000Y-83113044D01*
X184890000Y-81986956D01*
X184891623Y-81953929D01*
X184896475Y-81921219D01*
X184904509Y-81889143D01*
X184915649Y-81858009D01*
X184929787Y-81828116D01*
X184946787Y-81799753D01*
X184966485Y-81773193D01*
X184988692Y-81748692D01*
X185013193Y-81726485D01*
X185039753Y-81706787D01*
X185068116Y-81689787D01*
X185098009Y-81675649D01*
X185129143Y-81664509D01*
X185161219Y-81656475D01*
X185193929Y-81651623D01*
X185226956Y-81650000D01*
X186103044Y-81650000D01*
X186136071Y-81651623D01*
X186136071Y-81651623D01*
G37*
D13*
X185665000Y-82550000D03*
G04 #@! TD*
D12*
G04 #@! TO.C,R7*
G36*
X147546071Y-74031623D02*
X147578781Y-74036475D01*
X147610857Y-74044509D01*
X147641991Y-74055649D01*
X147671884Y-74069787D01*
X147700247Y-74086787D01*
X147726807Y-74106485D01*
X147751308Y-74128692D01*
X147773515Y-74153193D01*
X147793213Y-74179753D01*
X147810213Y-74208116D01*
X147824351Y-74238009D01*
X147835491Y-74269143D01*
X147843525Y-74301219D01*
X147848377Y-74333929D01*
X147850000Y-74366956D01*
X147850000Y-75493044D01*
X147848377Y-75526071D01*
X147843525Y-75558781D01*
X147835491Y-75590857D01*
X147824351Y-75621991D01*
X147810213Y-75651884D01*
X147793213Y-75680247D01*
X147773515Y-75706807D01*
X147751308Y-75731308D01*
X147726807Y-75753515D01*
X147700247Y-75773213D01*
X147671884Y-75790213D01*
X147641991Y-75804351D01*
X147610857Y-75815491D01*
X147578781Y-75823525D01*
X147546071Y-75828377D01*
X147513044Y-75830000D01*
X146636956Y-75830000D01*
X146603929Y-75828377D01*
X146571219Y-75823525D01*
X146539143Y-75815491D01*
X146508009Y-75804351D01*
X146478116Y-75790213D01*
X146449753Y-75773213D01*
X146423193Y-75753515D01*
X146398692Y-75731308D01*
X146376485Y-75706807D01*
X146356787Y-75680247D01*
X146339787Y-75651884D01*
X146325649Y-75621991D01*
X146314509Y-75590857D01*
X146306475Y-75558781D01*
X146301623Y-75526071D01*
X146300000Y-75493044D01*
X146300000Y-74366956D01*
X146301623Y-74333929D01*
X146306475Y-74301219D01*
X146314509Y-74269143D01*
X146325649Y-74238009D01*
X146339787Y-74208116D01*
X146356787Y-74179753D01*
X146376485Y-74153193D01*
X146398692Y-74128692D01*
X146423193Y-74106485D01*
X146449753Y-74086787D01*
X146478116Y-74069787D01*
X146508009Y-74055649D01*
X146539143Y-74044509D01*
X146571219Y-74036475D01*
X146603929Y-74031623D01*
X146636956Y-74030000D01*
X147513044Y-74030000D01*
X147546071Y-74031623D01*
X147546071Y-74031623D01*
G37*
D13*
X147075000Y-74930000D03*
D12*
G36*
X145496071Y-74031623D02*
X145528781Y-74036475D01*
X145560857Y-74044509D01*
X145591991Y-74055649D01*
X145621884Y-74069787D01*
X145650247Y-74086787D01*
X145676807Y-74106485D01*
X145701308Y-74128692D01*
X145723515Y-74153193D01*
X145743213Y-74179753D01*
X145760213Y-74208116D01*
X145774351Y-74238009D01*
X145785491Y-74269143D01*
X145793525Y-74301219D01*
X145798377Y-74333929D01*
X145800000Y-74366956D01*
X145800000Y-75493044D01*
X145798377Y-75526071D01*
X145793525Y-75558781D01*
X145785491Y-75590857D01*
X145774351Y-75621991D01*
X145760213Y-75651884D01*
X145743213Y-75680247D01*
X145723515Y-75706807D01*
X145701308Y-75731308D01*
X145676807Y-75753515D01*
X145650247Y-75773213D01*
X145621884Y-75790213D01*
X145591991Y-75804351D01*
X145560857Y-75815491D01*
X145528781Y-75823525D01*
X145496071Y-75828377D01*
X145463044Y-75830000D01*
X144586956Y-75830000D01*
X144553929Y-75828377D01*
X144521219Y-75823525D01*
X144489143Y-75815491D01*
X144458009Y-75804351D01*
X144428116Y-75790213D01*
X144399753Y-75773213D01*
X144373193Y-75753515D01*
X144348692Y-75731308D01*
X144326485Y-75706807D01*
X144306787Y-75680247D01*
X144289787Y-75651884D01*
X144275649Y-75621991D01*
X144264509Y-75590857D01*
X144256475Y-75558781D01*
X144251623Y-75526071D01*
X144250000Y-75493044D01*
X144250000Y-74366956D01*
X144251623Y-74333929D01*
X144256475Y-74301219D01*
X144264509Y-74269143D01*
X144275649Y-74238009D01*
X144289787Y-74208116D01*
X144306787Y-74179753D01*
X144326485Y-74153193D01*
X144348692Y-74128692D01*
X144373193Y-74106485D01*
X144399753Y-74086787D01*
X144428116Y-74069787D01*
X144458009Y-74055649D01*
X144489143Y-74044509D01*
X144521219Y-74036475D01*
X144553929Y-74031623D01*
X144586956Y-74030000D01*
X145463044Y-74030000D01*
X145496071Y-74031623D01*
X145496071Y-74031623D01*
G37*
D13*
X145025000Y-74930000D03*
G04 #@! TD*
D19*
G04 #@! TO.C,S1*
X192480000Y-54900000D03*
X185980000Y-54900000D03*
X192480000Y-59400000D03*
X185980000Y-59400000D03*
G04 #@! TD*
D20*
G04 #@! TO.C,SW1*
X125500000Y-48260000D03*
X128500000Y-48260000D03*
D21*
X127750000Y-50010000D03*
X124750000Y-50010000D03*
X129250000Y-50010000D03*
D22*
X123350000Y-47295000D03*
X130650000Y-47295000D03*
X123350000Y-49225000D03*
X130650000Y-49225000D03*
G04 #@! TD*
D23*
G04 #@! TO.C,U1*
X118110000Y-73660000D03*
X118110000Y-50800000D03*
D24*
X118110000Y-62230000D03*
G04 #@! TD*
D25*
G04 #@! TO.C,U2*
X182680000Y-67580000D03*
D26*
X190300000Y-75200000D03*
X182680000Y-70120000D03*
X190300000Y-72660000D03*
X182680000Y-72660000D03*
X190300000Y-70120000D03*
X182680000Y-75200000D03*
X190300000Y-67580000D03*
G04 #@! TD*
M02*
