EESchema Schematic File Version 4
LIBS:microbadge-cache
EELAYER 26 0
EELAYER END
$Descr A4 11693 8268
encoding utf-8
Sheet 1 1
Title "Microbadge - temperature to light"
Date "2018-12-08"
Rev "0.0.1"
Comp ""
Comment1 ""
Comment2 ""
Comment3 ""
Comment4 ""
$EndDescr
$Comp
L MCU_Microchip_ATtiny:ATtiny85-20PU U2
U 1 1 5C0BB421
P 3950 4950
F 0 "U2" H 3420 4996 50  0000 R CNN
F 1 "ATtiny85-20PU" H 3420 4905 50  0000 R CNN
F 2 "Package_DIP:DIP-8_W7.62mm" H 3950 4950 50  0001 C CIN
F 3 "http://ww1.microchip.com/downloads/en/DeviceDoc/atmel-2586-avr-8-bit-microcontroller-attiny25-attiny45-attiny85_datasheet.pdf" H 3950 4950 50  0001 C CNN
	1    3950 4950
	1    0    0    -1  
$EndComp
$Comp
L power:GND #PWR0101
U 1 1 5C0BB75F
P 5700 3500
F 0 "#PWR0101" H 5700 3250 50  0001 C CNN
F 1 "GND" H 5705 3327 50  0000 C CNN
F 2 "" H 5700 3500 50  0001 C CNN
F 3 "" H 5700 3500 50  0001 C CNN
	1    5700 3500
	1    0    0    -1  
$EndComp
Wire Wire Line
	5100 3500 5350 3500
$Comp
L pspice:CAP C2
U 1 1 5C0BB803
P 4950 3700
F 0 "C2" H 5128 3746 50  0000 L CNN
F 1 "100nF1" H 5128 3655 50  0000 L CNN
F 2 "Capacitor_SMD:C_0805_2012Metric_Pad1.15x1.40mm_HandSolder" H 4950 3700 50  0001 C CNN
F 3 "" H 4950 3700 50  0001 C CNN
	1    4950 3700
	1    0    0    -1  
$EndComp
$Comp
L pspice:CAP C1
U 1 1 5C0BB8CB
P 2400 4950
F 0 "C1" H 2578 4996 50  0000 L CNN
F 1 "100nF" H 2578 4905 50  0000 L CNN
F 2 "Capacitor_SMD:C_0805_2012Metric_Pad1.15x1.40mm_HandSolder" H 2400 4950 50  0001 C CNN
F 3 "" H 2400 4950 50  0001 C CNN
	1    2400 4950
	1    0    0    -1  
$EndComp
Wire Wire Line
	2400 4700 3250 4700
Wire Wire Line
	3250 4700 3250 4350
Wire Wire Line
	3250 4350 3950 4350
Wire Wire Line
	2400 5200 3250 5200
Wire Wire Line
	3250 5200 3250 5550
Wire Wire Line
	3250 5550 3950 5550
$Comp
L power:GND #PWR0102
U 1 1 5C0BBA3D
P 2150 5300
F 0 "#PWR0102" H 2150 5050 50  0001 C CNN
F 1 "GND" H 2155 5127 50  0000 C CNN
F 2 "" H 2150 5300 50  0001 C CNN
F 3 "" H 2150 5300 50  0001 C CNN
	1    2150 5300
	1    0    0    -1  
$EndComp
$Comp
L power:+5V #PWR0103
U 1 1 5C0BBB33
P 2150 4600
F 0 "#PWR0103" H 2150 4450 50  0001 C CNN
F 1 "+5V" H 2165 4773 50  0000 C CNN
F 2 "" H 2150 4600 50  0001 C CNN
F 3 "" H 2150 4600 50  0001 C CNN
	1    2150 4600
	1    0    0    -1  
$EndComp
Wire Wire Line
	2150 4600 2150 4700
Wire Wire Line
	2150 4700 2400 4700
Connection ~ 2400 4700
Wire Wire Line
	2150 5300 2150 5200
Wire Wire Line
	2150 5200 2400 5200
Connection ~ 2400 5200
$Comp
L Device:R R5
U 1 1 5C0BBE85
P 5150 4750
F 0 "R5" H 5220 4796 50  0000 L CNN
F 1 "22k" H 5220 4705 50  0000 L CNN
F 2 "Resistor_SMD:R_0805_2012Metric_Pad1.15x1.40mm_HandSolder" V 5080 4750 50  0001 C CNN
F 3 "~" H 5150 4750 50  0001 C CNN
	1    5150 4750
	1    0    0    -1  
$EndComp
$Comp
L Device:R R6
U 1 1 5C0BBEF5
P 5150 5350
F 0 "R6" H 5220 5396 50  0000 L CNN
F 1 "22k" H 5220 5305 50  0000 L CNN
F 2 "Resistor_SMD:R_0805_2012Metric_Pad1.15x1.40mm_HandSolder" V 5080 5350 50  0001 C CNN
F 3 "~" H 5150 5350 50  0001 C CNN
	1    5150 5350
	1    0    0    -1  
$EndComp
Wire Wire Line
	5150 5050 5150 4900
Wire Wire Line
	5150 4600 5150 4250
Wire Wire Line
	5150 4250 5350 4250
Connection ~ 5350 3500
Wire Wire Line
	5350 3500 5700 3500
Wire Wire Line
	5150 5050 5150 5200
Connection ~ 5150 5050
$Comp
L power:+5V #PWR0104
U 1 1 5C0BC405
P 5650 5500
F 0 "#PWR0104" H 5650 5350 50  0001 C CNN
F 1 "+5V" H 5665 5673 50  0000 C CNN
F 2 "" H 5650 5500 50  0001 C CNN
F 3 "" H 5650 5500 50  0001 C CNN
	1    5650 5500
	1    0    0    -1  
$EndComp
Wire Wire Line
	5150 5500 5650 5500
$Comp
L Device:LED D9
U 1 1 5C0BC685
P 4250 5850
F 0 "D9" H 4241 6066 50  0000 C CNN
F 1 "LED" H 4241 5975 50  0000 C CNN
F 2 "LED_SMD:LED_0603_1608Metric_Pad1.05x0.95mm_HandSolder" H 4250 5850 50  0001 C CNN
F 3 "~" H 4250 5850 50  0001 C CNN
	1    4250 5850
	1    0    0    -1  
$EndComp
$Comp
L Device:R R4
U 1 1 5C0BC947
P 4650 5600
F 0 "R4" H 4720 5646 50  0000 L CNN
F 1 "100" H 4720 5555 50  0000 L CNN
F 2 "Resistor_SMD:R_0805_2012Metric_Pad1.15x1.40mm_HandSolder" V 4580 5600 50  0001 C CNN
F 3 "~" H 4650 5600 50  0001 C CNN
	1    4650 5600
	1    0    0    -1  
$EndComp
Wire Wire Line
	4550 4750 4650 4750
Wire Wire Line
	4650 4750 4650 5450
Wire Wire Line
	4650 5750 4650 5850
Wire Wire Line
	4650 5850 4400 5850
Wire Wire Line
	4100 5850 3950 5850
Wire Wire Line
	3950 5850 3950 5550
Connection ~ 3950 5550
Wire Wire Line
	5350 4250 5350 4100
Wire Wire Line
	4950 5050 5150 5050
Wire Wire Line
	4950 3950 4950 4950
Wire Wire Line
	4550 4100 5350 4100
Connection ~ 5350 4100
Wire Wire Line
	5350 4100 5350 3500
$Comp
L LED:WS2812B D7
U 1 1 5C0C0C80
P 4250 2750
F 0 "D7" V 4296 2409 50  0000 R CNN
F 1 "WS2812B" V 4205 2409 50  0000 R CNN
F 2 "LED_SMD:LED_WS2812B_PLCC4_5.0x5.0mm_P3.2mm" H 4300 2450 50  0001 L TNN
F 3 "https://cdn-shop.adafruit.com/datasheets/WS2812B.pdf" H 4350 2375 50  0001 L TNN
	1    4250 2750
	0    -1   -1   0   
$EndComp
$Comp
L LED:WS2812B D6
U 1 1 5C0C2818
P 4250 2150
F 0 "D6" V 4296 1809 50  0000 R CNN
F 1 "WS2812B" V 4205 1809 50  0000 R CNN
F 2 "LED_SMD:LED_WS2812B_PLCC4_5.0x5.0mm_P3.2mm" H 4300 1850 50  0001 L TNN
F 3 "https://cdn-shop.adafruit.com/datasheets/WS2812B.pdf" H 4350 1775 50  0001 L TNN
	1    4250 2150
	0    -1   -1   0   
$EndComp
$Comp
L LED:WS2812B D5
U 1 1 5C0C28AA
P 4250 1550
F 0 "D5" V 4296 1209 50  0000 R CNN
F 1 "WS2812B" V 4205 1209 50  0000 R CNN
F 2 "LED_SMD:LED_WS2812B_PLCC4_5.0x5.0mm_P3.2mm" H 4300 1250 50  0001 L TNN
F 3 "https://cdn-shop.adafruit.com/datasheets/WS2812B.pdf" H 4350 1175 50  0001 L TNN
	1    4250 1550
	0    -1   -1   0   
$EndComp
$Comp
L LED:WS2812B D8
U 1 1 5C0C2E20
P 4250 3350
F 0 "D8" V 4296 3009 50  0000 R CNN
F 1 "WS2812B" V 4205 3009 50  0000 R CNN
F 2 "LED_SMD:LED_WS2812B_PLCC4_5.0x5.0mm_P3.2mm" H 4300 3050 50  0001 L TNN
F 3 "https://cdn-shop.adafruit.com/datasheets/WS2812B.pdf" H 4350 2975 50  0001 L TNN
	1    4250 3350
	0    -1   -1   0   
$EndComp
Wire Wire Line
	4550 4100 4550 3350
Wire Wire Line
	3950 4350 3950 3350
Connection ~ 3950 4350
Wire Wire Line
	3950 3350 3950 2750
Connection ~ 3950 3350
Connection ~ 3950 2150
Wire Wire Line
	3950 2150 3950 1550
Connection ~ 3950 2750
Wire Wire Line
	3950 2750 3950 2150
Wire Wire Line
	4550 3350 4550 2750
Connection ~ 4550 3350
Connection ~ 4550 2150
Wire Wire Line
	4550 2150 4550 1550
Connection ~ 4550 2750
Wire Wire Line
	4550 2750 4550 2150
Wire Wire Line
	4550 4950 4950 4950
Connection ~ 4950 4950
Wire Wire Line
	4950 4950 4950 5050
$Comp
L Sensor_Temperature:DS18B20 U3
U 1 1 5C0C8E86
P 5050 6000
F 0 "U3" H 4820 6046 50  0000 R CNN
F 1 "DS18B20" H 4820 5955 50  0000 R CNN
F 2 "Package_TO_SOT_THT:TO-92_Inline" H 4050 5750 50  0001 C CNN
F 3 "http://datasheets.maximintegrated.com/en/ds/DS18B20.pdf" H 4900 6250 50  0001 C CNN
	1    5050 6000
	1    0    0    -1  
$EndComp
Wire Wire Line
	5050 5700 5650 5700
Wire Wire Line
	5650 5700 5650 5500
Connection ~ 5650 5500
Wire Wire Line
	5050 6300 3950 6300
Wire Wire Line
	3950 6300 3950 5850
Connection ~ 3950 5850
Wire Wire Line
	5350 6000 5350 5600
Wire Wire Line
	5350 5600 4850 5600
Wire Wire Line
	4850 5600 4850 4850
Wire Wire Line
	4850 4850 4550 4850
$Comp
L Device:R R3
U 1 1 5C0CC3E1
P 4250 4000
F 0 "R3" H 4320 4046 50  0000 L CNN
F 1 "100" H 4320 3955 50  0000 L CNN
F 2 "Resistor_SMD:R_0805_2012Metric_Pad1.15x1.40mm_HandSolder" V 4180 4000 50  0001 C CNN
F 3 "~" H 4250 4000 50  0001 C CNN
	1    4250 4000
	1    0    0    -1  
$EndComp
Wire Wire Line
	4250 3650 4250 3850
Wire Wire Line
	4250 4150 4250 4300
Wire Wire Line
	4250 4300 4750 4300
Wire Wire Line
	4750 4300 4750 5050
Wire Wire Line
	4750 5050 4550 5050
$Comp
L Device:R R7
U 1 1 5C0CE6FC
P 5850 5850
F 0 "R7" H 5920 5896 50  0000 L CNN
F 1 "4.7k" H 5920 5805 50  0000 L CNN
F 2 "Resistor_SMD:R_0805_2012Metric_Pad1.15x1.40mm_HandSolder" V 5780 5850 50  0001 C CNN
F 3 "~" H 5850 5850 50  0001 C CNN
	1    5850 5850
	1    0    0    -1  
$EndComp
Wire Wire Line
	5350 6000 5850 6000
Connection ~ 5350 6000
Wire Wire Line
	5850 5700 5650 5700
Connection ~ 5650 5700
$Comp
L Device:LED D4
U 1 1 5C0D0240
P 3450 4050
F 0 "D4" H 3441 4266 50  0000 C CNN
F 1 "LED" H 3441 4175 50  0000 C CNN
F 2 "LED_SMD:LED_0603_1608Metric_Pad1.05x0.95mm_HandSolder" H 3450 4050 50  0001 C CNN
F 3 "~" H 3450 4050 50  0001 C CNN
	1    3450 4050
	1    0    0    -1  
$EndComp
$Comp
L Device:LED D2
U 1 1 5C0D02BF
P 3150 4050
F 0 "D2" H 3141 4266 50  0000 C CNN
F 1 "LED" H 3141 4175 50  0000 C CNN
F 2 "LED_SMD:LED_0603_1608Metric_Pad1.05x0.95mm_HandSolder" H 3150 4050 50  0001 C CNN
F 3 "~" H 3150 4050 50  0001 C CNN
	1    3150 4050
	1    0    0    -1  
$EndComp
$Comp
L Device:LED D1
U 1 1 5C0D035F
P 3150 3650
F 0 "D1" H 3141 3866 50  0000 C CNN
F 1 "LED" H 3141 3775 50  0000 C CNN
F 2 "LED_SMD:LED_0603_1608Metric_Pad1.05x0.95mm_HandSolder" H 3150 3650 50  0001 C CNN
F 3 "~" H 3150 3650 50  0001 C CNN
	1    3150 3650
	1    0    0    -1  
$EndComp
$Comp
L Device:LED D3
U 1 1 5C0D03DD
P 3450 3650
F 0 "D3" H 3441 3866 50  0000 C CNN
F 1 "LED" H 3441 3775 50  0000 C CNN
F 2 "LED_SMD:LED_0603_1608Metric_Pad1.05x0.95mm_HandSolder" H 3450 3650 50  0001 C CNN
F 3 "~" H 3450 3650 50  0001 C CNN
	1    3450 3650
	1    0    0    -1  
$EndComp
$Comp
L Device:R R1
U 1 1 5C0D0583
P 3750 3650
F 0 "R1" V 3543 3650 50  0000 C CNN
F 1 "33" V 3634 3650 50  0000 C CNN
F 2 "Resistor_SMD:R_0805_2012Metric_Pad1.15x1.40mm_HandSolder" V 3680 3650 50  0001 C CNN
F 3 "~" H 3750 3650 50  0001 C CNN
	1    3750 3650
	0    1    1    0   
$EndComp
$Comp
L Device:R R2
U 1 1 5C0D061D
P 3750 4050
F 0 "R2" V 3543 4050 50  0000 C CNN
F 1 "33" V 3634 4050 50  0000 C CNN
F 2 "Resistor_SMD:R_0805_2012Metric_Pad1.15x1.40mm_HandSolder" V 3680 4050 50  0001 C CNN
F 3 "~" H 3750 4050 50  0001 C CNN
	1    3750 4050
	0    1    1    0   
$EndComp
Wire Wire Line
	3900 3650 3900 4050
Wire Wire Line
	3900 4050 3900 4200
Wire Wire Line
	3900 4200 4150 4200
Wire Wire Line
	4150 4200 4150 4400
Wire Wire Line
	4150 4400 4550 4400
Wire Wire Line
	4550 4400 4550 4650
Connection ~ 3900 4050
Wire Wire Line
	3000 4050 2900 4050
Wire Wire Line
	2900 4050 2900 3650
Wire Wire Line
	2900 3650 3000 3650
$Comp
L power:GND #PWR0105
U 1 1 5C0D376E
P 2650 3650
F 0 "#PWR0105" H 2650 3400 50  0001 C CNN
F 1 "GND" H 2655 3477 50  0000 C CNN
F 2 "" H 2650 3650 50  0001 C CNN
F 3 "" H 2650 3650 50  0001 C CNN
	1    2650 3650
	1    0    0    -1  
$EndComp
Wire Wire Line
	2900 3650 2650 3650
Connection ~ 2900 3650
Wire Wire Line
	4950 2800 4950 3450
Wire Wire Line
	4950 2800 5100 2800
$Comp
L BAT-HLD-001:BAT-HLD-001 U1
U 1 1 5C133905
P 1700 4950
F 0 "U1" H 1700 4950 50  0001 L BNN
F 1 "BAT-HLD-001" H 1700 4950 50  0001 L BNN
F 2 "BAT-HLD-001:BAT-HLD-001" H 1700 4950 50  0001 L BNN
F 3 "None" H 1700 4950 50  0001 L BNN
F 4 "None" H 1700 4950 50  0001 L BNN "Feld4"
F 5 "BAT-HLD-001-TR" H 1700 4950 50  0001 L BNN "Feld5"
F 6 "Unavailable" H 1700 4950 50  0001 L BNN "Feld6"
F 7 "Linx Technologies" H 1700 4950 50  0001 L BNN "Feld7"
F 8 "CR2032 Battery Holder Surface Mount Tape and Reel" H 1700 4950 50  0001 L BNN "Feld8"
	1    1700 4950
	1    0    0    -1  
$EndComp
Wire Wire Line
	2150 5200 1700 5200
Wire Wire Line
	1700 5200 1700 5150
Connection ~ 2150 5200
$Comp
L PCM12SMTR:PCM12SMTR SW1
U 1 1 5C13678F
P 1600 4450
F 0 "SW1" H 1600 4815 50  0000 C CNN
F 1 "PCM12SMTR" H 1600 4724 50  0000 C CNN
F 2 "PCM12SMTR:SW_PCM12SMTR" H 1600 4450 50  0001 L BNN
F 3 "https://www.digikey.de/product-detail/en/c-k/PCM12SMTR/401-2016-1-ND/1640125?utm_source=snapeda&utm_medium=aggregator&utm_campaign=symbol" H 1600 4450 50  0001 L BNN
F 4 "DO-201 C&amp;K Components" H 1600 4450 50  0001 L BNN "Feld4"
F 5 "PCM12SMTR" H 1600 4450 50  0001 L BNN "Feld5"
F 6 "401-2016-1-ND" H 1600 4450 50  0001 L BNN "Feld6"
F 7 "Switch Slide ON ON SPDT Side Slide 0.3A 6VDC 10000Cycles Gull Wing SMD T/R" H 1600 4450 50  0001 L BNN "Feld7"
F 8 "C&K" H 1600 4450 50  0001 L BNN "Feld8"
	1    1600 4450
	0    -1   -1   0   
$EndComp
Wire Wire Line
	1600 4050 1600 3900
Wire Wire Line
	1600 3900 2000 3900
Wire Wire Line
	2000 3900 2000 4700
Wire Wire Line
	2000 4700 2150 4700
Connection ~ 2150 4700
$Comp
L 1825910-7:1825910-7 S1
U 1 1 5C13EFDF
P 3400 6050
F 0 "S1" H 3400 6417 50  0000 C CNN
F 1 "1825910-7" H 3400 6326 50  0000 C CNN
F 2 "1825910-7:SW_1825910-7" H 3400 6050 50  0001 L BNN
F 3 "TE Connectivity" H 3400 6050 50  0001 L BNN
F 4 "https://www.te.com/usa-en/product-1825910-7.html?te_bu=Cor&te_type=disp&te_campaign=seda_glo_cor-seda-global-disp-prtnr-fy19-seda-model-bom-cta_sma-317_1&elqCampaignId=32493" H 3400 6050 50  0001 L BNN "Feld4"
F 5 "None" H 3400 6050 50  0001 L BNN "Feld5"
F 6 "Switch Tactile OFF _ON_ SPST Round Button PC Pins 0.05A 24VDC 100000Cycle 2.55N Thru-Hole Loose Piece" H 3400 6050 50  0001 L BNN "Feld6"
F 7 "1825910-7" H 3400 6050 50  0001 L BNN "Feld7"
F 8 "Unavailable" H 3400 6050 50  0001 L BNN "Feld8"
F 9 "None" H 3400 6050 50  0001 L BNN "Feld9"
F 10 "1825910-7" H 3400 6050 50  0001 L BNN "Feld10"
	1    3400 6050
	1    0    0    -1  
$EndComp
Connection ~ 3250 5550
Wire Wire Line
	3800 5950 3850 5950
Wire Wire Line
	3850 5950 3850 5650
Wire Wire Line
	3850 5650 4550 5650
Wire Wire Line
	4550 5650 4550 5150
Wire Wire Line
	3000 5950 3000 5550
Wire Wire Line
	3000 5550 3250 5550
$Comp
L SJ-3524-SMT:SJ-3524-SMT J1
U 1 1 5C162EAB
P 5600 2900
F 0 "J1" H 5270 2904 50  0000 R CNN
F 1 "SJ-3524-SMT" H 5270 2995 50  0000 R CNN
F 2 "SJ-3524-SMT:CUI_SJ-3524-SMT" H 5600 2900 50  0001 L BNN
F 3 "Unavailable" H 5600 2900 50  0001 L BNN
F 4 "None" H 5600 2900 50  0001 L BNN "Feld4"
F 5 "None" H 5600 2900 50  0001 L BNN "Feld5"
F 6 "SJ-3524-SMT-TR" H 5600 2900 50  0001 L BNN "Feld6"
F 7 "SJ Series 3.5 mm 12 V SMT Right Angle Stereo Audio Jack" H 5600 2900 50  0001 L BNN "Feld7"
F 8 "https://www.cui.com/product/interconnect/audio-connectors/3.5-mm-jacks/sj-352x-smt-series?utm_source=snapeda.com&utm_medium=referral&utm_campaign=snapedaBOM" H 5600 2900 50  0001 L BNN "Feld8"
F 9 "CUI Inc." H 5600 2900 50  0001 L BNN "Feld9"
	1    5600 2900
	-1   0    0    1   
$EndComp
Wire Wire Line
	5100 3100 5100 3500
$EndSCHEMATC
