(module LOGO (layer F.Cu)
  (at 0 0)
 (fp_text reference "G***" (at 0 0) (layer F.SilkS) hide
  (effects (font (thickness 0.3)))
  )
  (fp_text value "LOGO" (at 0.75 0) (layer F.SilkS) hide
  (effects (font (thickness 0.3)))
  )
  (fp_poly (pts (xy -10.074981 -35.887333) (xy -9.585269 -35.853766) (xy -9.077232 -35.789600) (xy -8.594018 -35.699686) (xy -8.148635 -35.587563) (xy -7.754093 -35.456771) (xy -7.423398 -35.310850) (xy -7.271357 -35.224106)
     (xy -7.106832 -35.101615) (xy -6.896840 -34.915641) (xy -6.645540 -34.671300) (xy -6.357086 -34.373710) (xy -6.035635 -34.027988) (xy -5.685345 -33.639250) (xy -5.310370 -33.212615) (xy -4.914869 -32.753198)
     (xy -4.502996 -32.266118) (xy -4.078909 -31.756491) (xy -3.646765 -31.229435) (xy -3.210718 -30.690066) (xy -2.774927 -30.143501) (xy -2.343548 -29.594858) (xy -1.920736 -29.049254) (xy -1.510649 -28.511806)
     (xy -1.117443 -27.987631) (xy -0.745274 -27.481846) (xy -0.398299 -26.999568) (xy -0.080674 -26.545915) (xy 0.203444 -26.126003) (xy 0.449899 -25.744949) (xy 0.520654 -25.631205) (xy 0.696603 -25.373089)
     (xy 0.888839 -25.138833) (xy 1.083395 -24.942995) (xy 1.266300 -24.800132) (xy 1.374026 -24.741860) (xy 1.621267 -24.682370) (xy 1.900402 -24.691534) (xy 2.197994 -24.766500) (xy 2.500607 -24.904412)
     (xy 2.684821 -25.020255) (xy 2.908052 -25.165056) (xy 3.130305 -25.281943) (xy 3.367532 -25.375969) (xy 3.635683 -25.452185) (xy 3.950707 -25.515644) (xy 4.328557 -25.571395) (xy 4.487074 -25.591033)
     (xy 4.750982 -25.615021) (xy 5.079231 -25.633315) (xy 5.451678 -25.645776) (xy 5.848182 -25.652269) (xy 6.248599 -25.652654) (xy 6.632787 -25.646795) (xy 6.980603 -25.634554) (xy 7.271904 -25.615794)
     (xy 7.329765 -25.610445) (xy 7.881466 -25.544949) (xy 8.370435 -25.461840) (xy 8.817780 -25.355314) (xy 9.244607 -25.219566) (xy 9.672025 -25.048789) (xy 10.096500 -24.849488) (xy 10.804852 -24.449799)
     (xy 11.465487 -23.980336) (xy 12.077945 -23.441578) (xy 12.641766 -22.834000) (xy 13.156491 -22.158082) (xy 13.621659 -21.414300) (xy 13.888276 -20.912666) (xy 14.015245 -20.644198) (xy 14.118394 -20.390162)
     (xy 14.199644 -20.138100) (xy 14.260922 -19.875553) (xy 14.304152 -19.590062) (xy 14.331257 -19.269170) (xy 14.344163 -18.900417) (xy 14.344794 -18.471346) (xy 14.336197 -18.012972) (xy 14.311770 -17.235637)
     (xy 14.279574 -16.537234) (xy 14.239022 -15.912330) (xy 14.189525 -15.355495) (xy 14.130498 -14.861300) (xy 14.061351 -14.424311) (xy 13.981499 -14.039100) (xy 13.890353 -13.700235) (xy 13.859112 -13.601929)
     (xy 13.740261 -13.285944) (xy 13.583089 -12.931745) (xy 13.401616 -12.567664) (xy 13.209865 -12.222034) (xy 13.046109 -11.959166) (xy 12.739492 -11.528166) (xy 12.367494 -11.056285) (xy 11.935286 -10.549448)
     (xy 11.448041 -10.013580) (xy 10.910932 -9.454606) (xy 10.513325 -9.057919) (xy 10.080214 -8.639550) (xy 9.697467 -8.284380) (xy 9.362002 -7.989942) (xy 9.070735 -7.753771) (xy 8.820585 -7.573400)
     (xy 8.608468 -7.446364) (xy 8.431302 -7.370196) (xy 8.388122 -7.357796) (xy 8.213787 -7.277650) (xy 8.034160 -7.133866) (xy 7.863229 -6.945245) (xy 7.714982 -6.730590) (xy 7.603407 -6.508704)
     (xy 7.542492 -6.298389) (xy 7.535334 -6.211467) (xy 7.544380 -6.097507) (xy 7.576101 -5.989992) (xy 7.637368 -5.882177) (xy 7.735051 -5.767315) (xy 7.876021 -5.638658) (xy 8.067150 -5.489461)
     (xy 8.315308 -5.312976) (xy 8.627367 -5.102457) (xy 8.741834 -5.026808) (xy 9.192052 -4.715951) (xy 9.567942 -4.423159) (xy 9.875928 -4.141057) (xy 10.122438 -3.862272) (xy 10.313896 -3.579428)
     (xy 10.456729 -3.285150) (xy 10.557361 -2.972065) (xy 10.567123 -2.931961) (xy 10.605449 -2.675974) (xy 10.617386 -2.364916) (xy 10.603947 -2.023826) (xy 10.566141 -1.677743) (xy 10.504981 -1.351706)
     (xy 10.502952 -1.343150) (xy 10.472311 -1.229350) (xy 10.419694 -1.049521) (xy 10.349651 -0.818041) (xy 10.266731 -0.549285) (xy 10.175486 -0.257629) (xy 10.080465 0.042551) (xy 9.986219 0.336879)
     (xy 9.897297 0.610980) (xy 9.818249 0.850476) (xy 9.753627 1.040993) (xy 9.708680 1.166318) (xy 9.734554 1.206018) (xy 9.816874 1.288066) (xy 9.945139 1.402979) (xy 10.108851 1.541272)
     (xy 10.253957 1.658915) (xy 10.577392 1.923354) (xy 10.836989 2.151485) (xy 11.040826 2.351683) (xy 11.196979 2.532321) (xy 11.313528 2.701776) (xy 11.379374 2.825638) (xy 11.433498 2.951010)
     (xy 11.467094 3.063909) (xy 11.484660 3.191288) (xy 11.490693 3.360097) (xy 11.490648 3.492500) (xy 11.479130 3.779365) (xy 11.445535 4.021312) (xy 11.391857 4.233334) (xy 11.325703 4.412308)
     (xy 11.236238 4.577260) (xy 11.117043 4.732562) (xy 10.961695 4.882585) (xy 10.763775 5.031702) (xy 10.516861 5.184284) (xy 10.214533 5.344702) (xy 9.850370 5.517329) (xy 9.417950 5.706537)
     (xy 8.932334 5.907962) (xy 8.571663 6.056439) (xy 8.281196 6.181020) (xy 8.051758 6.287270) (xy 7.874178 6.380755) (xy 7.739283 6.467041) (xy 7.637900 6.551693) (xy 7.560857 6.640277)
     (xy 7.498981 6.738358) (xy 7.469447 6.795588) (xy 7.430404 6.878570) (xy 7.400492 6.955808) (xy 7.377950 7.040745) (xy 7.361015 7.146823) (xy 7.347924 7.287487) (xy 7.336914 7.476178)
     (xy 7.326223 7.726340) (xy 7.317704 7.952836) (xy 7.305344 8.237590) (xy 7.290181 8.506908) (xy 7.273395 8.744566) (xy 7.256168 8.934337) (xy 7.239683 9.059997) (xy 7.235587 9.080500)
     (xy 7.184652 9.258496) (xy 7.112714 9.421361) (xy 7.011901 9.577244) (xy 6.874339 9.734298) (xy 6.692156 9.900672) (xy 6.457478 10.084519) (xy 6.162432 10.293988) (xy 5.880020 10.483915)
     (xy 5.464511 10.770316) (xy 5.127814 11.027693) (xy 4.869388 11.256535) (xy 4.688691 11.457336) (xy 4.585179 11.630587) (xy 4.571198 11.669984) (xy 4.541460 11.839822) (xy 4.563229 11.999382)
     (xy 4.642403 12.159694) (xy 4.784880 12.331784) (xy 4.996558 12.526682) (xy 5.055672 12.575911) (xy 5.230584 12.725878) (xy 5.341773 12.840949) (xy 5.395817 12.933407) (xy 5.399295 13.015536)
     (xy 5.358786 13.099621) (xy 5.345923 13.117837) (xy 5.269968 13.184974) (xy 5.127687 13.277142) (xy 4.931567 13.388435) (xy 4.694093 13.512949) (xy 4.427752 13.644778) (xy 4.145031 13.778017)
     (xy 3.858415 13.906761) (xy 3.580392 14.025106) (xy 3.323447 14.127145) (xy 3.100068 14.206973) (xy 2.945522 14.253054) (xy 2.728600 14.291407) (xy 2.552373 14.276235) (xy 2.395221 14.200082)
     (xy 2.235525 14.055494) (xy 2.175067 13.987385) (xy 2.068688 13.867632) (xy 1.968489 13.771156) (xy 1.867061 13.699054) (xy 1.756993 13.652424) (xy 1.630877 13.632364) (xy 1.481304 13.639973)
     (xy 1.300863 13.676347) (xy 1.082147 13.742585) (xy 0.817746 13.839785) (xy 0.500250 13.969044) (xy 0.122250 14.131462) (xy -0.323663 14.328135) (xy -0.423333 14.372426) (xy -0.879972 14.573687)
     (xy -1.267571 14.740262) (xy -1.593123 14.874717) (xy -1.863622 14.979617) (xy -2.086059 15.057526) (xy -2.267427 15.111009) (xy -2.414719 15.142631) (xy -2.534929 15.154956) (xy -2.557875 15.155334)
     (xy -2.689384 15.142721) (xy -2.771377 15.097592) (xy -2.807789 15.009012) (xy -2.802551 14.866046) (xy -2.759595 14.657757) (xy -2.750210 14.620471) (xy -2.691860 14.364613) (xy -2.668071 14.176034)
     (xy -2.680828 14.043861) (xy -2.732117 13.957223) (xy -2.823924 13.905247) (xy -2.883778 13.889249) (xy -3.007520 13.877167) (xy -3.161809 13.888547) (xy -3.352986 13.925345) (xy -3.587392 13.989517)
     (xy -3.871368 14.083018) (xy -4.211255 14.207804) (xy -4.613394 14.365831) (xy -5.084126 14.559054) (xy -5.164666 14.592711) (xy -5.586981 14.766416) (xy -5.984124 14.923645) (xy -6.348056 15.061558)
     (xy -6.670737 15.177314) (xy -6.944129 15.268075) (xy -7.160189 15.331000) (xy -7.310880 15.363248) (xy -7.356601 15.367000) (xy -7.446837 15.361247) (xy -7.470880 15.329889) (xy -7.449993 15.259395)
     (xy -7.364342 15.092469) (xy -7.215899 14.874901) (xy -7.007160 14.609959) (xy -6.740618 14.300909) (xy -6.598551 14.144035) (xy -6.430515 13.960170) (xy -6.275974 13.789610) (xy -6.146961 13.645748)
     (xy -6.055512 13.541977) (xy -6.021876 13.502320) (xy -5.926585 13.385071) (xy -6.191209 13.466474) (xy -6.459984 13.548082) (xy -6.792623 13.647377) (xy -7.171462 13.759206) (xy -7.578837 13.878416)
     (xy -7.997084 13.999853) (xy -8.408539 14.118365) (xy -8.795540 14.228797) (xy -9.064283 14.304670) (xy -9.591802 14.457683) (xy -10.095286 14.613365) (xy -10.567698 14.769019) (xy -11.001998 14.921946)
     (xy -11.391147 15.069448) (xy -11.728107 15.208826) (xy -12.005840 15.337381) (xy -12.217306 15.452416) (xy -12.355467 15.551231) (xy -12.380400 15.576005) (xy -12.430470 15.637863) (xy -12.440505 15.690382)
     (xy -12.410660 15.767361) (xy -12.381547 15.824207) (xy -12.331622 15.892734) (xy -12.229291 16.011692) (xy -12.082718 16.172351) (xy -11.900067 16.365983) (xy -11.689500 16.583856) (xy -11.459180 16.817243)
     (xy -11.364173 16.912167) (xy -11.034196 17.244143) (xy -10.759494 17.529804) (xy -10.532144 17.779179) (xy -10.344222 18.002296) (xy -10.187806 18.209183) (xy -10.054974 18.409867) (xy -9.937801 18.614377)
     (xy -9.828365 18.832742) (xy -9.801682 18.889817) (xy -9.579016 19.468875) (xy -9.439084 20.060382) (xy -9.381375 20.661333) (xy -9.405378 21.268725) (xy -9.510581 21.879555) (xy -9.696476 22.490818)
     (xy -9.962549 23.099512) (xy -10.308291 23.702632) (xy -10.718258 24.278167) (xy -10.985887 24.592363) (xy -11.311975 24.930338) (xy -11.679764 25.276998) (xy -12.072499 25.617249) (xy -12.473421 25.935998)
     (xy -12.865775 26.218150) (xy -12.890500 26.234808) (xy -13.584599 26.670276) (xy -14.295117 27.054498) (xy -15.031486 27.390800) (xy -15.803138 27.682504) (xy -16.619505 27.932936) (xy -17.490019 28.145418)
     (xy -18.424113 28.323276) (xy -19.113500 28.427943) (xy -19.324121 28.451098) (xy -19.590254 28.471393) (xy -19.896116 28.488465) (xy -20.225929 28.501952) (xy -20.563909 28.511493) (xy -20.894278 28.516726)
     (xy -21.201255 28.517290) (xy -21.469058 28.512823) (xy -21.681907 28.502963) (xy -21.809995 28.489734) (xy -21.977084 28.455563) (xy -22.178459 28.403452) (xy -22.360328 28.347952) (xy -22.846377 28.220333)
     (xy -23.382151 28.143588) (xy -23.948418 28.119465) (xy -24.525942 28.149716) (xy -24.532166 28.150345) (xy -24.869265 28.180980) (xy -25.199979 28.204332) (xy -25.511655 28.220071) (xy -25.791641 28.227868)
     (xy -26.027284 28.227396) (xy -26.205930 28.218325) (xy -26.314927 28.200326) (xy -26.324277 28.196923) (xy -26.452922 28.100345) (xy -26.527287 27.946427) (xy -26.543000 27.813000) (xy -26.579752 27.616416)
     (xy -26.688482 27.463743) (xy -26.799676 27.388301) (xy -26.960216 27.331145) (xy -27.191217 27.284000) (xy -27.478879 27.248615) (xy -27.809400 27.226735) (xy -28.129389 27.220034) (xy -28.468056 27.210822)
     (xy -28.787684 27.185142) (xy -29.077028 27.145268) (xy -29.324842 27.093470) (xy -29.519882 27.032023) (xy -29.650903 26.963197) (xy -29.702993 26.902045) (xy -29.710233 26.779941) (xy -29.640986 26.670102)
     (xy -29.503333 26.580618) (xy -29.325103 26.523627) (xy -29.203430 26.457597) (xy -29.105949 26.330207) (xy -29.039998 26.163069) (xy -29.012914 25.977796) (xy -29.032034 25.795999) (xy -29.054865 25.727648)
     (xy -29.120688 25.618325) (xy -29.218745 25.544803) (xy -29.360592 25.504217) (xy -29.557780 25.493701) (xy -29.821865 25.510390) (xy -29.898682 25.518366) (xy -30.281741 25.568431) (xy -30.721614 25.639544)
     (xy -31.194374 25.727276) (xy -31.676092 25.827198) (xy -32.123465 25.930167) (xy -32.478685 26.010139) (xy -32.759250 26.058554) (xy -32.969234 26.074995) (xy -33.112712 26.059048) (xy -33.193758 26.010298)
     (xy -33.216448 25.928329) (xy -33.188645 25.821672) (xy -33.090839 25.671749) (xy -32.917173 25.514198) (xy -32.664729 25.346660) (xy -32.463764 25.234833) (xy -32.132766 25.043534) (xy -31.874870 24.854870)
     (xy -31.679230 24.660477) (xy -31.618601 24.582877) (xy -31.539341 24.452694) (xy -31.503249 24.323036) (xy -31.496000 24.184365) (xy -31.507174 23.996385) (xy -31.546778 23.872391) (xy -31.623934 23.793931)
     (xy -31.708207 23.755155) (xy -31.796365 23.735530) (xy -31.907241 23.733896) (xy -32.050852 23.752305) (xy -32.237214 23.792810) (xy -32.476348 23.857463) (xy -32.778269 23.948317) (xy -33.013342 24.022524)
     (xy -33.374831 24.135588) (xy -33.666842 24.220798) (xy -33.899067 24.280316) (xy -34.081196 24.316305) (xy -34.222919 24.330925) (xy -34.333927 24.326340) (xy -34.357827 24.322482) (xy -34.456811 24.293321)
     (xy -34.496177 24.240389) (xy -34.501666 24.176767) (xy -34.482249 24.078442) (xy -34.421136 23.959326) (xy -34.314035 23.814725) (xy -34.156653 23.639943) (xy -33.944698 23.430286) (xy -33.673879 23.181057)
     (xy -33.339902 22.887563) (xy -33.260654 22.819276) (xy -32.802809 22.425899) (xy -32.904535 22.314866) (xy -32.958077 22.254512) (xy -33.058689 22.139292) (xy -33.198266 21.978556) (xy -33.368704 21.781658)
     (xy -33.561896 21.557950) (xy -33.769737 21.316785) (xy -33.801070 21.280386) (xy -34.064975 20.976977) (xy -34.282212 20.734112) (xy -34.451498 20.553145) (xy -34.571551 20.435429) (xy -34.641087 20.382316)
     (xy -34.655162 20.379687) (xy -34.773729 20.421724) (xy -34.958739 20.483084) (xy -35.195406 20.559214) (xy -35.468943 20.645565) (xy -35.764563 20.737583) (xy -36.067479 20.830717) (xy -36.362903 20.920417)
     (xy -36.636050 21.002130) (xy -36.872131 21.071305) (xy -37.056360 21.123390) (xy -37.157776 21.150012) (xy -37.391974 21.198264) (xy -37.618076 21.229385) (xy -37.820588 21.242856) (xy -37.984017 21.238158)
     (xy -38.092870 21.214772) (xy -38.130141 21.182580) (xy -38.114596 21.094905) (xy -38.019890 20.978814) (xy -37.846499 20.834644) (xy -37.594896 20.662735) (xy -37.265555 20.463426) (xy -36.858950 20.237056)
     (xy -36.660666 20.131582) (xy -36.412647 19.997194) (xy -36.167064 19.856947) (xy -35.943466 19.722513) (xy -35.761402 19.605567) (xy -35.664043 19.536486) (xy -35.393042 19.298808) (xy -35.190755 19.055109)
     (xy -35.061788 18.812362) (xy -35.010747 18.577544) (xy -35.010080 18.546266) (xy -35.045405 18.371791) (xy -35.139967 18.176284) (xy -35.278420 17.978786) (xy -35.445419 17.798339) (xy -35.625618 17.653987)
     (xy -35.800092 17.565938) (xy -35.989032 17.530152) (xy -36.223479 17.534704) (xy -36.510330 17.580638) (xy -36.856482 17.669004) (xy -37.205531 17.779284) (xy -37.548433 17.890227) (xy -37.823263 17.967633)
     (xy -38.039046 18.012961) (xy -38.204805 18.027674) (xy -38.329562 18.013232) (xy -38.416110 17.975303) (xy -38.509051 17.875462) (xy -38.523593 17.755833) (xy -38.460818 17.625808) (xy -38.364583 17.527888)
     (xy -38.229717 17.433002) (xy -38.029124 17.314375) (xy -37.776003 17.178916) (xy -37.483552 17.033537) (xy -37.164967 16.885146) (xy -36.983787 16.804925) (xy -36.641982 16.643563) (xy -36.595687 16.617669)
     (xy -34.146821 16.617669) (xy -34.136950 17.010987) (xy -34.108873 17.385676) (xy -34.062839 17.716463) (xy -34.042857 17.815718) (xy -33.833586 18.564350) (xy -33.540747 19.300793) (xy -33.164611 20.024656)
     (xy -32.705450 20.735548) (xy -32.163536 21.433079) (xy -31.539142 22.116859) (xy -30.832539 22.786497) (xy -30.226000 23.297537) (xy -29.262228 24.017329) (xy -28.245782 24.673751) (xy -27.183919 25.263242)
     (xy -26.083892 25.782238) (xy -24.952957 26.227180) (xy -23.798370 26.594505) (xy -23.181046 26.756083) (xy -22.779485 26.849614) (xy -22.402903 26.928427) (xy -22.032587 26.995393) (xy -21.649827 27.053386)
     (xy -21.235912 27.105277) (xy -20.772130 27.153941) (xy -20.320000 27.195324) (xy -20.148553 27.203677) (xy -19.911132 27.206143) (xy -19.626175 27.203347) (xy -19.312123 27.195916) (xy -18.987417 27.184476)
     (xy -18.670497 27.169653) (xy -18.379804 27.152073) (xy -18.133777 27.132363) (xy -17.985855 27.116059) (xy -17.176726 26.984558) (xy -16.428828 26.809516) (xy -15.727935 26.585795) (xy -15.059819 26.308253)
     (xy -14.410255 25.971751) (xy -13.830499 25.614735) (xy -13.262999 25.211111) (xy -12.729374 24.774742) (xy -12.236052 24.313247) (xy -11.789455 23.834244) (xy -11.396011 23.345351) (xy -11.062144 22.854188)
     (xy -10.794280 22.368372) (xy -10.598845 21.895523) (xy -10.544165 21.718154) (xy -10.449370 21.221423) (xy -10.430957 20.702005) (xy -10.486991 20.169376) (xy -10.615535 19.633012) (xy -10.814652 19.102390)
     (xy -11.082405 18.586986) (xy -11.232218 18.351500) (xy -11.400319 18.131872) (xy -11.612046 17.898165) (xy -11.845923 17.671052) (xy -12.080475 17.471208) (xy -12.294226 17.319306) (xy -12.321435 17.302946)
     (xy -12.646959 17.137235) (xy -13.048457 16.974615) (xy -13.517241 16.817289) (xy -14.044622 16.667460) (xy -14.621914 16.527330) (xy -15.240426 16.399102) (xy -15.891473 16.284979) (xy -16.566364 16.187164)
     (xy -16.869833 16.149719) (xy -17.231823 16.114211) (xy -17.600136 16.090310) (xy -17.958461 16.078164) (xy -18.290484 16.077922) (xy -18.579896 16.089733) (xy -18.810383 16.113746) (xy -18.901833 16.131175)
     (xy -19.126988 16.167157) (xy -19.424269 16.187304) (xy -19.782736 16.192159) (xy -20.191446 16.182265) (xy -20.639460 16.158167) (xy -21.115835 16.120407) (xy -21.609631 16.069530) (xy -22.109908 16.006078)
     (xy -22.457833 15.954513) (xy -23.117002 15.842807) (xy -23.717512 15.724966) (xy -24.255695 15.602077) (xy -24.727882 15.475223) (xy -25.130402 15.345489) (xy -25.459588 15.213960) (xy -25.711769 15.081720)
     (xy -25.883277 14.949854) (xy -25.893951 14.938768) (xy -26.004463 14.802979) (xy -26.042732 14.704159) (xy -26.008791 14.635179) (xy -25.902675 14.588911) (xy -25.895614 14.587101) (xy -25.854743 14.578437)
     (xy -25.805652 14.572338) (xy -25.741313 14.569234) (xy -25.654692 14.569554) (xy -25.538760 14.573730) (xy -25.386485 14.582192) (xy -25.190836 14.595369) (xy -24.944782 14.613691) (xy -24.641292 14.637590)
     (xy -24.273334 14.667494) (xy -23.833879 14.703835) (xy -23.410333 14.739149) (xy -23.021685 14.764363) (xy -22.652305 14.771540) (xy -22.291087 14.758748) (xy -21.926922 14.724054) (xy -21.548701 14.665523)
     (xy -21.145317 14.581222) (xy -20.705661 14.469219) (xy -20.218626 14.327580) (xy -19.673103 14.154372) (xy -19.261666 14.017095) (xy -18.791211 13.859267) (xy -18.388477 13.728602) (xy -18.041814 13.622804)
     (xy -17.739566 13.539578) (xy -17.470081 13.476627) (xy -17.221706 13.431654) (xy -16.982788 13.402364) (xy -16.741672 13.386461) (xy -16.486706 13.381647) (xy -16.206236 13.385628) (xy -16.076242 13.389428)
     (xy -15.794356 13.404765) (xy -15.459048 13.433199) (xy -15.083985 13.472710) (xy -14.682836 13.521282) (xy -14.269267 13.576898) (xy -13.856948 13.637541) (xy -13.459546 13.701193) (xy -13.090728 13.765837)
     (xy -12.764163 13.829457) (xy -12.493518 13.890034) (xy -12.292461 13.945552) (xy -12.279709 13.949742) (xy -12.072911 13.999981) (xy -11.877008 14.002698) (xy -11.676285 13.953742) (xy -11.455034 13.848963)
     (xy -11.197541 13.684208) (xy -11.151406 13.651631) (xy -10.933298 13.483187) (xy -10.791002 13.335795) (xy -10.722603 13.196934) (xy -10.726188 13.054084) (xy -10.799842 12.894726) (xy -10.941651 12.706339)
     (xy -10.997093 12.642408) (xy -11.152014 12.432333) (xy -11.262423 12.209957) (xy -11.326452 11.989259) (xy -11.342236 11.784223) (xy -11.307907 11.608827) (xy -11.221599 11.477053) (xy -11.158686 11.432062)
     (xy -10.997019 11.378751) (xy -10.816672 11.385255) (xy -10.612618 11.453970) (xy -10.379828 11.587290) (xy -10.113274 11.787611) (xy -9.807929 12.057330) (xy -9.768606 12.094318) (xy -9.436500 12.375119)
     (xy -9.117238 12.577776) (xy -8.813058 12.701401) (xy -8.526198 12.745105) (xy -8.258894 12.708000) (xy -8.238930 12.701682) (xy -8.020376 12.589740) (xy -7.845790 12.422173) (xy -7.722662 12.215686)
     (xy -7.658478 11.986987) (xy -7.660113 11.816693) (xy -5.715000 11.816693) (xy -5.679842 11.942711) (xy -5.579303 12.023937) (xy -5.420787 12.058834) (xy -5.211698 12.045863) (xy -4.959439 11.983486)
     (xy -4.941081 11.977471) (xy -4.709523 11.884178) (xy -4.465266 11.757615) (xy -4.220166 11.607050) (xy -3.986079 11.441752) (xy -3.774859 11.270991) (xy -3.598363 11.104036) (xy -3.468447 10.950156)
     (xy -3.396965 10.818620) (xy -3.386825 10.762304) (xy -3.417173 10.693877) (xy -3.497425 10.590187) (xy -3.610999 10.468391) (xy -3.741312 10.345647) (xy -3.871779 10.239111) (xy -3.934705 10.195478)
     (xy -4.089384 10.112239) (xy -4.226868 10.079656) (xy -4.360924 10.101944) (xy -4.505320 10.183318) (xy -4.673825 10.327995) (xy -4.807276 10.462664) (xy -5.014243 10.692154) (xy -5.209160 10.931597)
     (xy -5.383708 11.168583) (xy -5.529567 11.390700) (xy -5.638418 11.585540) (xy -5.701940 11.740692) (xy -5.715000 11.816693) (xy -7.660113 11.816693) (xy -7.660727 11.752781) (xy -7.724412 11.553760)
     (xy -7.779539 11.473943) (xy -7.883694 11.350314) (xy -8.024159 11.196995) (xy -8.188221 11.028109) (xy -8.274177 10.943167) (xy -8.495109 10.721634) (xy -8.655963 10.543187) (xy -8.762561 10.397761)
     (xy -8.820730 10.275289) (xy -8.836294 10.165706) (xy -8.815078 10.058946) (xy -8.803475 10.028514) (xy -8.702966 9.890271) (xy -8.540484 9.806169) (xy -8.319195 9.776263) (xy -8.042265 9.800606)
     (xy -7.712859 9.879253) (xy -7.355600 10.003766) (xy -7.143030 10.082927) (xy -6.937193 10.151774) (xy -6.762288 10.202668) (xy -6.647098 10.227394) (xy -6.421044 10.231370) (xy -6.255512 10.176344)
     (xy -6.151803 10.063723) (xy -6.111215 9.894912) (xy -6.134616 9.673243) (xy -6.201249 9.461781) (xy -6.301270 9.311448) (xy -6.452285 9.200192) (xy -6.549529 9.153561) (xy -6.733750 9.083023)
     (xy -6.929618 9.026876) (xy -7.150166 8.983300) (xy -7.408425 8.950476) (xy -7.717426 8.926582) (xy -8.090200 8.909800) (xy -8.347737 8.902439) (xy -8.994787 8.897941) (xy -9.577846 8.918872)
     (xy -10.114330 8.967398) (xy -10.621655 9.045682) (xy -11.117237 9.155887) (xy -11.618492 9.300180) (xy -11.662833 9.314381) (xy -12.052643 9.431953) (xy -12.370357 9.508990) (xy -12.618454 9.545042)
     (xy -12.799415 9.539663) (xy -12.915717 9.492402) (xy -12.969841 9.402814) (xy -12.964266 9.270448) (xy -12.901471 9.094856) (xy -12.899583 9.090760) (xy -12.831976 8.957612) (xy -12.748502 8.820789)
     (xy -12.641270 8.670167) (xy -12.502389 8.495619) (xy -12.323968 8.287021) (xy -12.098116 8.034247) (xy -11.947605 7.869214) (xy -11.543563 7.409852) (xy -11.425053 7.260167) (xy -9.376833 7.260167)
     (xy -9.218053 7.337751) (xy -9.090124 7.384383) (xy -8.918950 7.426796) (xy -8.773553 7.451258) (xy -8.564140 7.467004) (xy -8.306526 7.470802) (xy -8.030171 7.463682) (xy -7.764532 7.446678)
     (xy -7.539068 7.420821) (xy -7.450666 7.404909) (xy -7.232228 7.349368) (xy -7.090531 7.287466) (xy -7.017725 7.209235) (xy -7.005961 7.104709) (xy -7.047390 6.963922) (xy -7.066976 6.917724)
     (xy -7.178747 6.708696) (xy -7.336322 6.473091) (xy -7.525849 6.226720) (xy -7.733478 5.985397) (xy -7.945359 5.764933) (xy -8.147641 5.581142) (xy -8.326473 5.449835) (xy -8.378445 5.420480)
     (xy -8.491319 5.367044) (xy -8.562694 5.352355) (xy -8.624956 5.373817) (xy -8.663302 5.397627) (xy -8.766790 5.494789) (xy -8.886855 5.654569) (xy -9.012701 5.859465) (xy -9.133531 6.091973)
     (xy -9.233931 6.322719) (xy -9.313955 6.551794) (xy -9.357375 6.748329) (xy -9.372671 6.951448) (xy -9.372868 6.963834) (xy -9.376833 7.260167) (xy -11.425053 7.260167) (xy -11.204474 6.981565)
     (xy -10.922534 6.572129) (xy -10.689938 6.169322) (xy -10.498880 5.760920) (xy -10.354708 5.374618) (xy -10.202532 4.799952) (xy -10.133741 4.239923) (xy -10.148274 3.694865) (xy -10.246066 3.165106)
     (xy -10.427055 2.650979) (xy -10.691178 2.152815) (xy -11.038372 1.670944) (xy -11.066803 1.636612) (xy -11.334767 1.368888) (xy -11.669466 1.120216) (xy -12.053415 0.901002) (xy -12.469126 0.721650)
     (xy -12.763500 0.627087) (xy -12.895207 0.593509) (xy -13.022406 0.568863) (xy -13.161836 0.551779) (xy -13.330233 0.540889) (xy -13.544334 0.534825) (xy -13.820876 0.532217) (xy -13.927666 0.531884)
     (xy -14.221879 0.532109) (xy -14.449753 0.535286) (xy -14.629609 0.543034) (xy -14.779765 0.556971) (xy -14.918539 0.578717) (xy -15.064250 0.609889) (xy -15.206871 0.644912) (xy -15.678379 0.777327)
     (xy -16.108530 0.928467) (xy -16.513225 1.106775) (xy -16.908364 1.320695) (xy -17.309849 1.578673) (xy -17.733582 1.889151) (xy -18.098805 2.180625) (xy -18.354683 2.384949) (xy -18.557983 2.531686)
     (xy -18.715996 2.623115) (xy -18.836010 2.661519) (xy -18.925317 2.649176) (xy -18.991208 2.588368) (xy -19.040972 2.481374) (xy -19.042812 2.475922) (xy -19.072811 2.332090) (xy -19.085294 2.157705)
     (xy -19.083165 2.073721) (xy -19.021370 1.779913) (xy -18.879227 1.490775) (xy -18.661022 1.208605) (xy -18.371041 0.935697) (xy -18.013569 0.674348) (xy -17.592891 0.426852) (xy -17.113295 0.195507)
     (xy -16.579064 -0.017393) (xy -15.994486 -0.209552) (xy -15.363844 -0.378674) (xy -14.691427 -0.522463) (xy -14.033500 -0.631274) (xy -13.824266 -0.658818) (xy -13.568730 -0.688622) (xy -13.277857 -0.719759)
     (xy -12.962607 -0.751303) (xy -12.633944 -0.782327) (xy -12.302830 -0.811903) (xy -11.980227 -0.839105) (xy -11.677098 -0.863005) (xy -11.404405 -0.882677) (xy -11.173111 -0.897193) (xy -10.994179 -0.905627)
     (xy -10.878570 -0.907051) (xy -10.837678 -0.901521) (xy -10.809567 -0.858909) (xy -10.742253 -0.752406) (xy -10.640862 -0.590255) (xy -10.510521 -0.380698) (xy -10.356357 -0.131978) (xy -10.183496 0.147661)
     (xy -9.997066 0.449977) (xy -9.993361 0.455992) (xy -9.624541 1.045497) (xy -9.257970 1.611485) (xy -8.887486 2.162058) (xy -8.506922 2.705315) (xy -8.110114 3.249359) (xy -7.690897 3.802290)
     (xy -7.243107 4.372210) (xy -6.760578 4.967219) (xy -6.237145 5.595420) (xy -5.666645 6.264912) (xy -5.042912 6.983798) (xy -4.912078 7.133253) (xy -4.494904 7.611114) (xy -4.130779 8.032785)
     (xy -3.815140 8.404116) (xy -3.543421 8.730959) (xy -3.311059 9.019164) (xy -3.113489 9.274582) (xy -2.946148 9.503063) (xy -2.804470 9.710460) (xy -2.683893 9.902621) (xy -2.579850 10.085400)
     (xy -2.520257 10.199317) (xy -2.428273 10.390938) (xy -2.359956 10.563117) (xy -2.309167 10.739120) (xy -2.269771 10.942215) (xy -2.235631 11.195667) (xy -2.219621 11.339121) (xy -2.164290 11.726168)
     (xy -2.087457 12.035824) (xy -1.985535 12.273448) (xy -1.854934 12.444398) (xy -1.692066 12.554035) (xy -1.493344 12.607716) (xy -1.365081 12.615334) (xy -1.191283 12.596921) (xy -1.015899 12.537972)
     (xy -0.831550 12.432922) (xy -0.630859 12.276205) (xy -0.406446 12.062254) (xy -0.150935 11.785505) (xy 0.059184 11.540961) (xy 0.235331 11.345892) (xy 0.390779 11.215267) (xy 0.539796 11.147976)
     (xy 0.696646 11.142908) (xy 0.875594 11.198953) (xy 1.090905 11.314999) (xy 1.291167 11.445029) (xy 1.645175 11.650559) (xy 1.979845 11.774416) (xy 2.294686 11.816520) (xy 2.589209 11.776789)
     (xy 2.793921 11.694584) (xy 3.008742 11.548600) (xy 3.170744 11.360705) (xy 3.282732 11.123726) (xy 3.347511 10.830491) (xy 3.367886 10.473824) (xy 3.361000 10.244667) (xy 3.350497 10.032736)
     (xy 3.347818 9.887231) (xy 3.354874 9.790120) (xy 3.373577 9.723368) (xy 3.405841 9.668941) (xy 3.424643 9.644481) (xy 3.488674 9.577625) (xy 3.568909 9.526018) (xy 3.678125 9.486569)
     (xy 3.829097 9.456185) (xy 4.034602 9.431775) (xy 4.307415 9.410246) (xy 4.423834 9.402651) (xy 4.786411 9.372942) (xy 5.079553 9.334126) (xy 5.296315 9.287156) (xy 5.321901 9.279438)
     (xy 5.645904 9.150960) (xy 5.901018 8.994792) (xy 6.084405 8.815295) (xy 6.193227 8.616832) (xy 6.224644 8.403763) (xy 6.175819 8.180452) (xy 6.116174 8.058987) (xy 5.967720 7.868548)
     (xy 5.757218 7.702428) (xy 5.478959 7.557530) (xy 5.127232 7.430760) (xy 4.790667 7.340685) (xy 4.525327 7.274642) (xy 4.322873 7.214636) (xy 4.162765 7.152266) (xy 4.024461 7.079135)
     (xy 3.887420 6.986843) (xy 3.841297 6.952510) (xy 3.716018 6.848659) (xy 3.583950 6.720137) (xy 3.442203 6.562616) (xy 3.287885 6.371770) (xy 3.118106 6.143271) (xy 2.929973 5.872793)
     (xy 2.720597 5.556007) (xy 2.487085 5.188588) (xy 2.226546 4.766207) (xy 1.936090 4.284538) (xy 1.612825 3.739254) (xy 1.253860 3.126027) (xy 1.048634 2.772834) (xy 0.546931 1.904449)
     (xy 0.088932 1.105104) (xy -0.326739 0.372171) (xy -0.701455 -0.296979) (xy -1.036590 -0.904976) (xy -1.333518 -1.454448) (xy -1.593614 -1.948025) (xy -1.818252 -2.388334) (xy -2.008805 -2.778006)
     (xy -2.166648 -3.119668) (xy -2.293155 -3.415951) (xy -2.389700 -3.669482) (xy -2.457657 -3.882892) (xy -2.483490 -3.984755) (xy -2.516589 -4.142372) (xy -2.528096 -4.242948) (xy -2.518036 -4.311302)
     (xy -2.486434 -4.372254) (xy -2.483890 -4.376162) (xy -2.398085 -4.473601) (xy -2.307752 -4.499339) (xy -2.202488 -4.451883) (xy -2.071889 -4.329739) (xy -2.058621 -4.315124) (xy -1.925457 -4.155687)
     (xy -1.762363 -3.939983) (xy -1.568284 -3.666356) (xy -1.342162 -3.333147) (xy -1.082942 -2.938699) (xy -0.789568 -2.481354) (xy -0.460984 -1.959455) (xy -0.096133 -1.371343) (xy 0.306041 -0.715361)
     (xy 0.746594 0.010148) (xy 1.226582 0.806844) (xy 1.573782 1.386331) (xy 1.825106 1.806500) (xy 2.064444 2.206369) (xy 2.288133 2.579834) (xy 2.492511 2.920791) (xy 2.673914 3.223137)
     (xy 2.828679 3.480767) (xy 2.953142 3.687578) (xy 3.043639 3.837467) (xy 3.096509 3.924329) (xy 3.108504 3.943449) (xy 3.129868 3.958130) (xy 3.166255 3.950856) (xy 3.224569 3.916005)
     (xy 3.311713 3.847952) (xy 3.434590 3.741073) (xy 3.600104 3.589744) (xy 3.815158 3.388341) (xy 3.972385 3.239661) (xy 4.275127 2.954559) (xy 4.523157 2.726822) (xy 4.721834 2.554150)
     (xy 4.876517 2.434242) (xy 4.992565 2.364799) (xy 5.075337 2.343520) (xy 5.130192 2.368105) (xy 5.162489 2.436254) (xy 5.177586 2.545666) (xy 5.180844 2.694042) (xy 5.180626 2.721056)
     (xy 5.138910 3.087834) (xy 5.020601 3.474570) (xy 4.824542 3.884389) (xy 4.634589 4.195505) (xy 4.450549 4.487711) (xy 4.318799 4.732056) (xy 4.233482 4.942224) (xy 4.188742 5.131899)
     (xy 4.178402 5.261430) (xy 4.206642 5.454990) (xy 4.299475 5.593903) (xy 4.457238 5.678536) (xy 4.581169 5.703187) (xy 4.803403 5.696210) (xy 4.978426 5.619455) (xy 5.106839 5.472384)
     (xy 5.189243 5.254459) (xy 5.210588 5.139494) (xy 5.262165 4.889497) (xy 5.340280 4.707919) (xy 5.452763 4.580606) (xy 5.555072 4.516723) (xy 5.687921 4.466145) (xy 5.812297 4.457401)
     (xy 5.941642 4.495809) (xy 6.089398 4.586688) (xy 6.269006 4.735356) (xy 6.389668 4.846931) (xy 6.601133 5.037152) (xy 6.776592 5.168099) (xy 6.931779 5.247516) (xy 7.082430 5.283147)
     (xy 7.244282 5.282733) (xy 7.269966 5.280101) (xy 7.508240 5.213170) (xy 7.710166 5.075324) (xy 7.868769 4.875056) (xy 7.977077 4.620859) (xy 8.025156 4.360334) (xy 8.069566 4.075484)
     (xy 8.147929 3.864830) (xy 8.264099 3.723428) (xy 8.421932 3.646336) (xy 8.596672 3.627742) (xy 8.734070 3.639577) (xy 8.862159 3.676827) (xy 9.000637 3.748820) (xy 9.169204 3.864884)
     (xy 9.286164 3.954228) (xy 9.527182 4.115005) (xy 9.742790 4.197865) (xy 9.939738 4.203210) (xy 10.124777 4.131444) (xy 10.274490 4.013277) (xy 10.413725 3.828208) (xy 10.472545 3.625078)
     (xy 10.451870 3.409344) (xy 10.352620 3.186463) (xy 10.175716 2.961890) (xy 10.081960 2.871497) (xy 9.805489 2.656186) (xy 9.497780 2.482977) (xy 9.149989 2.349426) (xy 8.753273 2.253088)
     (xy 8.298791 2.191519) (xy 7.777699 2.162274) (xy 7.504694 2.159000) (xy 7.289460 2.157251) (xy 7.108038 2.152443) (xy 6.975429 2.145234) (xy 6.906630 2.136283) (xy 6.900334 2.132460)
     (xy 6.928608 2.095779) (xy 7.007815 2.007705) (xy 7.129529 1.877221) (xy 7.285328 1.713311) (xy 7.466785 1.524958) (xy 7.560529 1.428498) (xy 8.015392 0.948659) (xy 8.403529 0.509331)
     (xy 8.728672 0.104074) (xy 8.994552 -0.273548) (xy 9.204903 -0.629974) (xy 9.363454 -0.971644) (xy 9.473938 -1.304995) (xy 9.540087 -1.636466) (xy 9.565632 -1.972494) (xy 9.566205 -2.032000)
     (xy 9.532008 -2.468658) (xy 9.427163 -2.862212) (xy 9.248760 -3.220347) (xy 8.993892 -3.550749) (xy 8.989807 -3.555171) (xy 8.769872 -3.762999) (xy 8.557641 -3.897297) (xy 8.337770 -3.966008)
     (xy 8.170352 -3.979333) (xy 8.043892 -3.975239) (xy 7.954820 -3.953484) (xy 7.873543 -3.899858) (xy 7.770470 -3.800149) (xy 7.747272 -3.776163) (xy 7.657412 -3.673307) (xy 7.577885 -3.557649)
     (xy 7.504598 -3.418547) (xy 7.433460 -3.245358) (xy 7.360380 -3.027442) (xy 7.281268 -2.754155) (xy 7.192030 -2.414856) (xy 7.132200 -2.176268) (xy 6.979691 -1.590557) (xy 6.831743 -1.085048)
     (xy 6.686744 -0.655502) (xy 6.543086 -0.297678) (xy 6.399159 -0.007336) (xy 6.253353 0.219762) (xy 6.194667 0.293232) (xy 6.059075 0.420226) (xy 5.939536 0.464597) (xy 5.834542 0.426552)
     (xy 5.768893 0.350988) (xy 5.739662 0.295231) (xy 5.719205 0.222374) (xy 5.706181 0.117906) (xy 5.699253 -0.032686) (xy 5.697080 -0.243914) (xy 5.697589 -0.421595) (xy 5.700146 -0.640011)
     (xy 5.706439 -0.829586) (xy 5.718491 -1.007616) (xy 5.738324 -1.191394) (xy 5.767960 -1.398214) (xy 5.809422 -1.645371) (xy 5.864731 -1.950158) (xy 5.895791 -2.116666) (xy 5.983503 -2.589982)
     (xy 6.055346 -2.991819) (xy 6.112826 -3.333564) (xy 6.157451 -3.626604) (xy 6.190727 -3.882324) (xy 6.214161 -4.112112) (xy 6.229259 -4.327354) (xy 6.237528 -4.539435) (xy 6.240277 -4.720166)
     (xy 6.231783 -5.103472) (xy 6.197509 -5.414299) (xy 6.132592 -5.662211) (xy 6.032167 -5.856771) (xy 5.891373 -6.007544) (xy 5.705345 -6.124093) (xy 5.481598 -6.212048) (xy 5.221990 -6.305846)
     (xy 5.043279 -6.397168) (xy 4.942003 -6.490787) (xy 4.914704 -6.591481) (xy 4.957922 -6.704023) (xy 5.046938 -6.811975) (xy 5.130197 -6.892166) (xy 5.223416 -6.970039) (xy 5.335802 -7.051162)
     (xy 5.476562 -7.141101) (xy 5.654903 -7.245421) (xy 5.880032 -7.369689) (xy 6.161156 -7.519472) (xy 6.507481 -7.700335) (xy 6.569852 -7.732680) (xy 7.196254 -8.063983) (xy 7.753545 -8.373964)
     (xy 8.252333 -8.669813) (xy 8.703227 -8.958721) (xy 9.116838 -9.247877) (xy 9.503775 -9.544472) (xy 9.874647 -9.855695) (xy 10.240063 -10.188737) (xy 10.352621 -10.296307) (xy 10.979224 -10.948556)
     (xy 11.528241 -11.622591) (xy 12.002829 -12.324608) (xy 12.406144 -13.060805) (xy 12.741339 -13.837378) (xy 13.011571 -14.660524) (xy 13.219996 -15.536440) (xy 13.322621 -16.129000) (xy 13.345140 -16.299165)
     (xy 13.362891 -16.483647) (xy 13.376360 -16.694471) (xy 13.386034 -16.943660) (xy 13.392398 -17.243238) (xy 13.395939 -17.605229) (xy 13.397092 -17.970500) (xy 13.396118 -18.415064) (xy 13.391369 -18.786237)
     (xy 13.381622 -19.095253) (xy 13.365651 -19.353350) (xy 13.342232 -19.571763) (xy 13.310138 -19.761729) (xy 13.268146 -19.934483) (xy 13.215031 -20.101262) (xy 13.149566 -20.273302) (xy 13.144740 -20.285215)
     (xy 12.962291 -20.667408) (xy 12.718103 -21.077606) (xy 12.423849 -21.501634) (xy 12.091204 -21.925317) (xy 11.731841 -22.334482) (xy 11.357433 -22.714952) (xy 10.979654 -23.052554) (xy 10.667649 -23.293070)
     (xy 10.044940 -23.682992) (xy 9.370447 -24.007061) (xy 8.646144 -24.264834) (xy 7.874004 -24.455869) (xy 7.055998 -24.579725) (xy 6.194101 -24.635961) (xy 5.290284 -24.624133) (xy 4.853737 -24.595116)
     (xy 4.450977 -24.552109) (xy 4.115540 -24.491737) (xy 3.830735 -24.407120) (xy 3.579868 -24.291375) (xy 3.346248 -24.137619) (xy 3.113183 -23.938971) (xy 3.003007 -23.832069) (xy 2.745581 -23.552647)
     (xy 2.563656 -23.303746) (xy 2.455431 -23.081343) (xy 2.419110 -22.881413) (xy 2.452894 -22.699930) (xy 2.475226 -22.650797) (xy 2.573719 -22.522277) (xy 2.733067 -22.382140) (xy 2.932972 -22.242907)
     (xy 3.153136 -22.117095) (xy 3.373260 -22.017225) (xy 3.573045 -21.955815) (xy 3.614030 -21.948441) (xy 3.769190 -21.945664) (xy 3.934385 -21.986783) (xy 4.119480 -22.076947) (xy 4.334341 -22.221304)
     (xy 4.588835 -22.425003) (xy 4.683961 -22.506790) (xy 4.973467 -22.749915) (xy 5.218019 -22.933738) (xy 5.426920 -23.063950) (xy 5.609478 -23.146244) (xy 5.774998 -23.186310) (xy 5.799612 -23.189095)
     (xy 5.924318 -23.197679) (xy 5.990059 -23.185497) (xy 6.021855 -23.142502) (xy 6.035944 -23.094182) (xy 6.039168 -22.941385) (xy 5.989071 -22.736213) (xy 5.888597 -22.489557) (xy 5.852741 -22.416325)
     (xy 5.767269 -22.193304) (xy 5.726192 -21.963544) (xy 5.731129 -21.751058) (xy 5.783694 -21.579858) (xy 5.795102 -21.560305) (xy 5.937087 -21.410230) (xy 6.129661 -21.321584) (xy 6.364435 -21.295054)
     (xy 6.633016 -21.331326) (xy 6.927013 -21.431087) (xy 6.995219 -21.462073) (xy 7.243986 -21.558619) (xy 7.461625 -21.599908) (xy 7.637408 -21.585015) (xy 7.746606 -21.526856) (xy 7.846941 -21.385616)
     (xy 7.885305 -21.197626) (xy 7.861526 -20.960110) (xy 7.775432 -20.670293) (xy 7.679279 -20.437650) (xy 7.569756 -20.170942) (xy 7.511320 -19.961070) (xy 7.504434 -19.797007) (xy 7.549558 -19.667724)
     (xy 7.647154 -19.562195) (xy 7.717952 -19.513559) (xy 7.877416 -19.455960) (xy 8.102003 -19.432963) (xy 8.379579 -19.444535) (xy 8.698008 -19.490643) (xy 8.824356 -19.516583) (xy 9.072257 -19.562672)
     (xy 9.305975 -19.590238) (xy 9.507635 -19.598387) (xy 9.659362 -19.586224) (xy 9.731664 -19.561987) (xy 9.776944 -19.487776) (xy 9.765081 -19.368844) (xy 9.702583 -19.216302) (xy 9.595955 -19.041262)
     (xy 9.451704 -18.854836) (xy 9.276336 -18.668136) (xy 9.131857 -18.537596) (xy 8.751830 -18.263241) (xy 8.362931 -18.070323) (xy 7.968239 -17.960307) (xy 7.893718 -17.949011) (xy 7.579986 -17.895746)
     (xy 7.334970 -17.822259) (xy 7.143354 -17.718677) (xy 6.989823 -17.575125) (xy 6.859060 -17.381731) (xy 6.782914 -17.232910) (xy 6.577214 -16.894093) (xy 6.300043 -16.591878) (xy 5.958688 -16.331793)
     (xy 5.560437 -16.119366) (xy 5.112577 -15.960123) (xy 5.100529 -15.956794) (xy 4.850930 -15.906375) (xy 4.573567 -15.879941) (xy 4.291133 -15.876953) (xy 4.026318 -15.896868) (xy 3.801817 -15.939146)
     (xy 3.661834 -15.991103) (xy 3.547146 -16.058422) (xy 3.466314 -16.131288) (xy 3.413300 -16.225635) (xy 3.382065 -16.357395) (xy 3.366570 -16.542503) (xy 3.360899 -16.785166) (xy 3.353300 -17.068498)
     (xy 3.334186 -17.313447) (xy 3.299123 -17.545477) (xy 3.243675 -17.790049) (xy 3.163408 -18.072626) (xy 3.102821 -18.266833) (xy 2.939741 -18.748080) (xy 2.753976 -19.236854) (xy 2.541506 -19.741523)
     (xy 2.491041 -19.851283) (xy 4.991348 -19.851283) (xy 5.032548 -19.687203) (xy 5.118313 -19.568533) (xy 5.277088 -19.448012) (xy 5.468265 -19.380196) (xy 5.710534 -19.359289) (xy 5.787716 -19.360958)
     (xy 5.952300 -19.374554) (xy 6.062608 -19.405536) (xy 6.148626 -19.463060) (xy 6.162047 -19.475252) (xy 6.238175 -19.566238) (xy 6.258487 -19.665517) (xy 6.252553 -19.734608) (xy 6.196601 -19.921820)
     (xy 6.077427 -20.073979) (xy 5.884972 -20.203532) (xy 5.865438 -20.213633) (xy 5.661174 -20.296053) (xy 5.482750 -20.314848) (xy 5.302750 -20.272214) (xy 5.274673 -20.260972) (xy 5.116644 -20.156916)
     (xy 5.020791 -20.014103) (xy 4.991348 -19.851283) (xy 2.491041 -19.851283) (xy 2.298312 -20.270453) (xy 2.020374 -20.832010) (xy 1.703674 -21.434562) (xy 1.344193 -22.086474) (xy 0.937911 -22.796114)
     (xy 0.876025 -22.902333) (xy 0.547710 -23.457458) (xy 0.209186 -24.016185) (xy -0.136075 -24.573540) (xy -0.484600 -25.124548) (xy -0.832918 -25.664234) (xy -1.177557 -26.187624) (xy -1.515045 -26.689744)
     (xy -1.841910 -27.165619) (xy -2.154680 -27.610275) (xy -2.449884 -28.018736) (xy -2.724049 -28.386029) (xy -2.973703 -28.707178) (xy -3.195376 -28.977210) (xy -3.385594 -29.191149) (xy -3.540886 -29.344022)
     (xy -3.657780 -29.430853) (xy -3.690451 -29.445198) (xy -3.788715 -29.433495) (xy -3.902189 -29.346485) (xy -4.026255 -29.191175) (xy -4.156296 -28.974569) (xy -4.287694 -28.703674) (xy -4.415831 -28.385495)
     (xy -4.448099 -28.295729) (xy -4.674133 -27.748558) (xy -4.959766 -27.234150) (xy -5.237482 -26.833089) (xy -5.455929 -26.559349) (xy -5.696313 -26.292368) (xy -5.966755 -26.025103) (xy -6.275374 -25.750509)
     (xy -6.630292 -25.461543) (xy -7.039630 -25.151161) (xy -7.511507 -24.812320) (xy -7.792571 -24.616833) (xy -8.121640 -24.367325) (xy -8.405985 -24.105772) (xy -8.636435 -23.842466) (xy -8.803819 -23.587704)
     (xy -8.889735 -23.385308) (xy -8.914382 -23.275506) (xy -8.910347 -23.175083) (xy -8.874200 -23.047946) (xy -8.851846 -22.986495) (xy -8.750201 -22.755502) (xy -8.598938 -22.468082) (xy -8.403639 -22.132007)
     (xy -8.169890 -21.755046) (xy -7.903275 -21.344968) (xy -7.609379 -20.909544) (xy -7.293785 -20.456542) (xy -6.962078 -19.993733) (xy -6.619842 -19.528886) (xy -6.272663 -19.069770) (xy -5.926123 -18.624156)
     (xy -5.585808 -18.199814) (xy -5.257302 -17.804511) (xy -4.946190 -17.446020) (xy -4.658055 -17.132108) (xy -4.602048 -17.073674) (xy -4.417196 -16.893723) (xy -4.209537 -16.709442) (xy -4.007437 -16.545191)
     (xy -3.871701 -16.446511) (xy -3.642096 -16.278763) (xy -3.482602 -16.126997) (xy -3.383753 -15.978291) (xy -3.336080 -15.819725) (xy -3.328051 -15.704566) (xy -3.357947 -15.490385) (xy -3.450342 -15.262616)
     (xy -3.609296 -15.014049) (xy -3.838873 -14.737472) (xy -3.924626 -14.645329) (xy -4.228882 -14.344221) (xy -4.511553 -14.107124) (xy -4.789404 -13.922563) (xy -5.079202 -13.779068) (xy -5.322409 -13.688893)
     (xy -5.492934 -13.650510) (xy -5.726449 -13.621851) (xy -6.001785 -13.603355) (xy -6.297777 -13.595462) (xy -6.593255 -13.598609) (xy -6.867054 -13.613235) (xy -7.098007 -13.639780) (xy -7.159194 -13.650821)
     (xy -7.652339 -13.789328) (xy -8.110939 -13.999067) (xy -8.536275 -14.281385) (xy -8.888915 -14.600754) (xy -6.793966 -14.600754) (xy -6.789181 -14.585237) (xy -6.712565 -14.496886) (xy -6.571838 -14.436939)
     (xy -6.382942 -14.406236) (xy -6.161822 -14.405616) (xy -5.924418 -14.435921) (xy -5.686675 -14.497990) (xy -5.616344 -14.523444) (xy -5.397295 -14.633074) (xy -5.198879 -14.777662) (xy -5.032734 -14.943615)
     (xy -4.910498 -15.117343) (xy -4.843809 -15.285255) (xy -4.842533 -15.427108) (xy -4.912980 -15.543592) (xy -5.048384 -15.621962) (xy -5.235428 -15.656385) (xy -5.360480 -15.654068) (xy -5.555054 -15.615827)
     (xy -5.768611 -15.537084) (xy -5.989233 -15.426755) (xy -6.205003 -15.293757) (xy -6.404003 -15.147003) (xy -6.574317 -14.995411) (xy -6.704027 -14.847895) (xy -6.781216 -14.713371) (xy -6.793966 -14.600754)
     (xy -8.888915 -14.600754) (xy -8.929631 -14.637628) (xy -9.292289 -15.069144) (xy -9.625530 -15.577279) (xy -9.930637 -16.163379) (xy -10.208893 -16.828791) (xy -10.224230 -16.869833) (xy -10.346065 -17.212342)
     (xy -10.443244 -17.525189) (xy -10.515202 -17.818510) (xy -10.561373 -18.102438) (xy -10.581195 -18.387109) (xy -10.574101 -18.682656) (xy -10.539528 -18.999214) (xy -10.476911 -19.346917) (xy -10.385685 -19.735900)
     (xy -10.265285 -20.176297) (xy -10.115148 -20.678243) (xy -9.989736 -21.078973) (xy -9.883922 -21.416175) (xy -9.804267 -21.684315) (xy -9.750380 -21.894728) (xy -9.721868 -22.058749) (xy -9.718342 -22.187712)
     (xy -9.739408 -22.292953) (xy -9.784677 -22.385805) (xy -9.853756 -22.477604) (xy -9.938220 -22.571104) (xy -10.109950 -22.722285) (xy -10.324285 -22.864442) (xy -10.549980 -22.979552) (xy -10.755791 -23.049592)
     (xy -10.774501 -23.053506) (xy -10.876877 -23.056844) (xy -10.971632 -23.019208) (xy -11.066115 -22.932379) (xy -11.167675 -22.788134) (xy -11.283662 -22.578254) (xy -11.386240 -22.369249) (xy -11.660269 -21.848689)
     (xy -11.987394 -21.322149) (xy -12.352690 -20.810012) (xy -12.741230 -20.332656) (xy -13.138090 -19.910463) (xy -13.296378 -19.761090) (xy -13.875112 -19.289476) (xy -14.491339 -18.889236) (xy -15.138893 -18.563548)
     (xy -15.811613 -18.315591) (xy -16.375286 -18.172987) (xy -16.657165 -18.131440) (xy -16.997491 -18.105562) (xy -17.371859 -18.095136) (xy -17.755867 -18.099947) (xy -18.125112 -18.119778) (xy -18.455192 -18.154413)
     (xy -18.678045 -18.193382) (xy -19.409351 -18.396691) (xy -20.106481 -18.675387) (xy -20.772136 -19.030939) (xy -21.409015 -19.464820) (xy -22.019817 -19.978498) (xy -22.110061 -20.063196) (xy -22.622579 -20.599950)
     (xy -23.054682 -21.159334) (xy -23.408468 -21.744997) (xy -23.686034 -22.360585) (xy -23.889476 -23.009746) (xy -23.945805 -23.256375) (xy -23.967943 -23.380610) (xy -23.985382 -23.522388) (xy -23.998653 -23.693070)
     (xy -24.008289 -23.904017) (xy -24.013120 -24.098174) (xy -22.878192 -24.098174) (xy -22.860384 -23.701995) (xy -22.818633 -23.343516) (xy -22.786011 -23.174985) (xy -22.602717 -22.560005) (xy -22.346459 -21.983058)
     (xy -22.021860 -21.448290) (xy -21.633545 -20.959846) (xy -21.186139 -20.521871) (xy -20.684264 -20.138510) (xy -20.132547 -19.813910) (xy -19.535610 -19.552214) (xy -18.898078 -19.357569) (xy -18.420820 -19.261950)
     (xy -18.223391 -19.242309) (xy -17.963958 -19.233254) (xy -17.664408 -19.233943) (xy -17.346631 -19.243535) (xy -17.032513 -19.261186) (xy -16.743943 -19.286054) (xy -16.502809 -19.317297) (xy -16.383000 -19.340363)
     (xy -15.699655 -19.536499) (xy -15.076147 -19.792502) (xy -14.512195 -20.108625) (xy -14.007516 -20.485119) (xy -13.561830 -20.922233) (xy -13.174854 -21.420221) (xy -12.846308 -21.979332) (xy -12.575909 -22.599819)
     (xy -12.506207 -22.797608) (xy -12.312157 -23.496852) (xy -12.181647 -24.238803) (xy -12.116855 -25.007831) (xy -12.113335 -25.616214) (xy -12.120858 -25.839995) (xy -12.131474 -26.001889) (xy -12.149803 -26.124659)
     (xy -12.180468 -26.231072) (xy -12.228090 -26.343892) (xy -12.284748 -26.460612) (xy -12.412887 -26.675099) (xy -12.599653 -26.926821) (xy -12.834258 -27.204536) (xy -13.105914 -27.497000) (xy -13.403835 -27.792970)
     (xy -13.717232 -28.081203) (xy -14.035319 -28.350457) (xy -14.280432 -28.540578) (xy -14.613860 -28.761663) (xy -14.998733 -28.973941) (xy -15.403832 -29.162247) (xy -15.797937 -29.311418) (xy -15.980833 -29.366514)
     (xy -16.142944 -29.408502) (xy -16.284047 -29.438845) (xy -16.423476 -29.459420) (xy -16.580563 -29.472104) (xy -16.774643 -29.478775) (xy -17.025050 -29.481310) (xy -17.166166 -29.481606) (xy -17.452074 -29.480677)
     (xy -17.673485 -29.476144) (xy -17.850554 -29.466131) (xy -18.003435 -29.448758) (xy -18.152279 -29.422149) (xy -18.317242 -29.384427) (xy -18.382320 -29.368300) (xy -19.054560 -29.171978) (xy -19.663858 -28.933668)
     (xy -20.224353 -28.646408) (xy -20.750184 -28.303240) (xy -21.099559 -28.030742) (xy -21.573071 -27.582767) (xy -21.978340 -27.085331) (xy -22.313494 -26.541536) (xy -22.576662 -25.954485) (xy -22.765974 -25.327281)
     (xy -22.787726 -25.230666) (xy -22.841887 -24.890735) (xy -22.872034 -24.503829) (xy -22.878192 -24.098174) (xy -24.013120 -24.098174) (xy -24.014823 -24.166590) (xy -24.018789 -24.492150) (xy -24.020610 -24.851393)
     (xy -24.022012 -25.213067) (xy -24.024323 -25.499924) (xy -24.028131 -25.721814) (xy -24.034024 -25.888587) (xy -24.042592 -26.010093) (xy -24.054423 -26.096181) (xy -24.070106 -26.156702) (xy -24.090229 -26.201504)
     (xy -24.102504 -26.221647) (xy -24.162509 -26.297455) (xy -24.230065 -26.325818) (xy -24.340772 -26.320276) (xy -24.356504 -26.318258) (xy -24.527787 -26.274357) (xy -24.752258 -26.184246) (xy -25.019865 -26.054594)
     (xy -25.320552 -25.892072) (xy -25.644267 -25.703349) (xy -25.980956 -25.495095) (xy -26.320565 -25.273981) (xy -26.653041 -25.046676) (xy -26.968329 -24.819850) (xy -27.256376 -24.600173) (xy -27.507128 -24.394315)
     (xy -27.710531 -24.208947) (xy -27.856532 -24.050738) (xy -27.923380 -23.951873) (xy -27.953389 -23.884691) (xy -27.959394 -23.824012) (xy -27.936327 -23.747222) (xy -27.879121 -23.631708) (xy -27.832266 -23.545294)
     (xy -27.682382 -23.291986) (xy -27.481378 -22.986759) (xy -27.228061 -22.628002) (xy -26.921239 -22.214107) (xy -26.559723 -21.743466) (xy -26.142319 -21.214469) (xy -25.694773 -20.658666) (xy -25.157409 -19.986638)
     (xy -24.679110 -19.366018) (xy -24.256417 -18.791121) (xy -23.885874 -18.256262) (xy -23.564025 -17.755754) (xy -23.287413 -17.283914) (xy -23.052581 -16.835055) (xy -22.856073 -16.403492) (xy -22.694432 -15.983540)
     (xy -22.564202 -15.569513) (xy -22.534844 -15.461310) (xy -22.479981 -15.227872) (xy -22.445938 -15.011865) (xy -22.428362 -14.777429) (xy -22.423147 -14.541500) (xy -22.429217 -14.213732) (xy -22.457370 -13.938539)
     (xy -22.514945 -13.696742) (xy -22.609281 -13.469161) (xy -22.747715 -13.236615) (xy -22.937586 -12.979926) (xy -23.093556 -12.789264) (xy -23.337127 -12.513106) (xy -23.612902 -12.228420) (xy -23.930590 -11.925969)
     (xy -24.299901 -11.596518) (xy -24.730542 -11.230833) (xy -24.741882 -11.221393) (xy -25.311193 -10.726837) (xy -25.809825 -10.246963) (xy -26.247513 -9.769967) (xy -26.633996 -9.284041) (xy -26.979008 -8.777380)
     (xy -27.292288 -8.238176) (xy -27.443908 -7.944982) (xy -27.757472 -7.230325) (xy -28.014584 -6.458659) (xy -28.215465 -5.628718) (xy -28.360336 -4.739234) (xy -28.449419 -3.788942) (xy -28.482936 -2.776573)
     (xy -28.474134 -2.053166) (xy -28.453040 -1.519412) (xy -28.420381 -1.047732) (xy -28.372168 -0.621454) (xy -28.304414 -0.223908) (xy -28.213130 0.161578) (xy -28.094326 0.551676) (xy -27.944016 0.963057)
     (xy -27.758210 1.412392) (xy -27.532919 1.916352) (xy -27.515277 1.954735) (xy -27.038104 2.907234) (xy -26.488179 3.854538) (xy -25.876634 4.779970) (xy -25.214601 5.666853) (xy -24.513211 6.498511)
     (xy -24.396344 6.627230) (xy -24.034134 7.031527) (xy -23.735698 7.386054) (xy -23.498825 7.694092) (xy -23.321305 7.958924) (xy -23.200928 8.183832) (xy -23.135485 8.372098) (xy -23.122145 8.519500)
     (xy -23.139899 8.640664) (xy -23.185536 8.712764) (xy -23.281798 8.771246) (xy -23.284537 8.772589) (xy -23.403474 8.811583) (xy -23.588363 8.848261) (xy -23.820494 8.879192) (xy -23.919537 8.888936)
     (xy -24.240277 8.929060) (xy -24.626624 8.996556) (xy -25.065367 9.087878) (xy -25.543292 9.199479) (xy -26.047188 9.327814) (xy -26.563843 9.469337) (xy -27.080044 9.620501) (xy -27.582579 9.777760)
     (xy -28.058236 9.937569) (xy -28.493802 10.096382) (xy -28.659666 10.161157) (xy -29.525082 10.539782) (xy -30.321092 10.956018) (xy -31.046492 11.408660) (xy -31.700082 11.896504) (xy -32.280659 12.418343)
     (xy -32.787019 12.972973) (xy -33.217962 13.559189) (xy -33.572284 14.175785) (xy -33.848783 14.821556) (xy -34.046256 15.495297) (xy -34.064735 15.578667) (xy -34.110961 15.876236) (xy -34.138241 16.230994)
     (xy -34.146821 16.617669) (xy -36.595687 16.617669) (xy -36.346437 16.478259) (xy -36.102407 16.313777) (xy -35.915152 16.154882) (xy -35.789930 16.006340) (xy -35.731997 15.872914) (xy -35.746612 15.759370)
     (xy -35.780133 15.714133) (xy -35.866326 15.677992) (xy -36.019089 15.665101) (xy -36.223818 15.674639) (xy -36.465910 15.705786) (xy -36.730763 15.757720) (xy -36.785712 15.770658) (xy -37.046781 15.831700)
     (xy -37.344419 15.897636) (xy -37.663088 15.965377) (xy -37.987248 16.031832) (xy -38.301362 16.093910) (xy -38.589890 16.148520) (xy -38.837295 16.192573) (xy -39.028036 16.222978) (xy -39.116000 16.234134)
     (xy -39.288273 16.245197) (xy -39.400374 16.234478) (xy -39.473482 16.200646) (xy -39.519502 16.159959) (xy -39.521161 16.121278) (xy -39.471273 16.062459) (xy -39.409982 16.004948) (xy -39.293976 15.918964)
     (xy -39.112784 15.810553) (xy -38.880640 15.686630) (xy -38.611776 15.554111) (xy -38.320426 15.419912) (xy -38.020822 15.290951) (xy -37.727199 15.174142) (xy -37.613166 15.131847) (xy -37.113545 14.947171)
     (xy -36.687707 14.781113) (xy -36.327769 14.629957) (xy -36.025846 14.489985) (xy -35.774056 14.357481) (xy -35.564513 14.228729) (xy -35.389333 14.100013) (xy -35.343603 14.061964) (xy -35.182225 13.891716)
     (xy -35.083102 13.716810) (xy -35.049780 13.549698) (xy -35.085804 13.402837) (xy -35.136666 13.335000) (xy -35.228472 13.282294) (xy -35.376643 13.255371) (xy -35.587098 13.254235) (xy -35.865758 13.278890)
     (xy -36.218541 13.329342) (xy -36.258500 13.335868) (xy -36.561140 13.382537) (xy -36.786080 13.409586) (xy -36.937914 13.417291) (xy -37.021238 13.405925) (xy -37.041666 13.382725) (xy -37.010267 13.330571)
     (xy -36.926663 13.242421) (xy -36.806744 13.132594) (xy -36.666402 13.015406) (xy -36.521527 12.905175) (xy -36.476475 12.873483) (xy -36.239102 12.729355) (xy -35.934010 12.574105) (xy -35.576277 12.414302)
     (xy -35.180982 12.256515) (xy -34.763204 12.107312) (xy -34.579592 12.047172) (xy -34.190482 11.918619) (xy -33.871870 11.801853) (xy -33.611458 11.690965) (xy -33.396946 11.580046) (xy -33.216037 11.463188)
     (xy -33.056432 11.334480) (xy -33.012610 11.294316) (xy -32.827796 11.142151) (xy -32.570750 10.963553) (xy -32.248326 10.762313) (xy -31.867378 10.542222) (xy -31.434763 10.307073) (xy -30.957334 10.060657)
     (xy -30.441948 9.806765) (xy -29.895458 9.549188) (xy -29.675666 9.448685) (xy -29.206139 9.239335) (xy -28.775789 9.055811) (xy -28.357632 8.887403) (xy -27.924686 8.723404) (xy -27.449966 8.553106)
     (xy -27.199166 8.465922) (xy -26.850245 8.341832) (xy -26.534169 8.221996) (xy -26.259173 8.110046) (xy -26.033494 8.009613) (xy -25.865367 7.924329) (xy -25.763028 7.857825) (xy -25.733981 7.819879)
     (xy -25.733821 7.718281) (xy -25.755015 7.603976) (xy -25.802737 7.460992) (xy -25.882157 7.273359) (xy -25.976613 7.070685) (xy -26.086895 6.845115) (xy -26.198918 6.628747) (xy -26.320127 6.408907)
     (xy -26.457969 6.172922) (xy -26.619890 5.908118) (xy -26.813335 5.601822) (xy -27.045750 5.241361) (xy -27.104059 5.151675) (xy -27.592928 4.379892) (xy -28.021850 3.655488) (xy -28.393761 2.969146)
     (xy -28.711599 2.311552) (xy -28.978298 1.673390) (xy -29.196796 1.045344) (xy -29.370029 0.418099) (xy -29.500933 -0.217660) (xy -29.592444 -0.871249) (xy -29.647498 -1.551983) (xy -29.669031 -2.269179)
     (xy -29.661919 -2.963333) (xy -29.623685 -3.868859) (xy -29.557447 -4.702022) (xy -29.460260 -5.471335) (xy -29.329179 -6.185307) (xy -29.161259 -6.852450) (xy -28.953554 -7.481276) (xy -28.703120 -8.080295)
     (xy -28.407010 -8.658019) (xy -28.062280 -9.222958) (xy -27.665984 -9.783624) (xy -27.215177 -10.348529) (xy -27.032367 -10.562166) (xy -26.939181 -10.665095) (xy -26.794246 -10.819810) (xy -26.605511 -11.018063)
     (xy -26.380927 -11.251603) (xy -26.128444 -11.512182) (xy -25.856012 -11.791550) (xy -25.571581 -12.081456) (xy -25.420885 -12.234333) (xy -25.036813 -12.624636) (xy -24.708974 -12.961902) (xy -24.433107 -13.252334)
     (xy -24.204954 -13.502132) (xy -24.020253 -13.717498) (xy -23.874746 -13.904633) (xy -23.764172 -14.069740) (xy -23.684272 -14.219019) (xy -23.630786 -14.358673) (xy -23.599455 -14.494902) (xy -23.586017 -14.633908)
     (xy -23.586215 -14.781893) (xy -23.592334 -14.896389) (xy -23.660250 -15.360531) (xy -23.803447 -15.859330) (xy -24.020881 -16.390792) (xy -24.311511 -16.952925) (xy -24.674294 -17.543735) (xy -25.108187 -18.161230)
     (xy -25.612148 -18.803414) (xy -25.676138 -18.880666) (xy -26.214790 -19.529649) (xy -26.699488 -20.118421) (xy -27.132574 -20.650012) (xy -27.516389 -21.127452) (xy -27.853274 -21.553771) (xy -28.145570 -21.932000)
     (xy -28.395619 -22.265167) (xy -28.605762 -22.556303) (xy -28.778339 -22.808437) (xy -28.915693 -23.024600) (xy -29.020164 -23.207822) (xy -29.021131 -23.209650) (xy -29.119585 -23.403122) (xy -29.181704 -23.547988)
     (xy -29.215339 -23.667868) (xy -29.228338 -23.786379) (xy -29.229504 -23.836623) (xy -29.218810 -24.009512) (xy -29.176940 -24.139709) (xy -29.129856 -24.217623) (xy -29.009372 -24.360357) (xy -28.817858 -24.545645)
     (xy -28.556803 -24.772340) (xy -28.227696 -25.039298) (xy -27.832023 -25.345374) (xy -27.371275 -25.689421) (xy -26.846939 -26.070296) (xy -26.260505 -26.486852) (xy -25.613459 -26.937945) (xy -25.429374 -27.064950)
     (xy -24.759278 -27.533088) (xy -24.154668 -27.969595) (xy -23.617164 -28.373201) (xy -23.148385 -28.742631) (xy -22.749947 -29.076614) (xy -22.423471 -29.373877) (xy -22.188387 -29.613474) (xy -22.075142 -29.740582)
     (xy -22.009288 -29.829253) (xy -21.980118 -29.902642) (xy -21.976927 -29.983903) (xy -21.984111 -30.055275) (xy -22.052223 -30.356556) (xy -22.189644 -30.685738) (xy -22.398728 -31.048163) (xy -22.465701 -31.149359)
     (xy -22.646121 -31.422112) (xy -22.778139 -31.640492) (xy -22.866043 -31.816401) (xy -22.911477 -31.953754) (xy -21.172048 -31.953754) (xy -21.155344 -31.718460) (xy -21.094125 -31.450638) (xy -20.990017 -31.162367)
     (xy -20.885242 -30.940916) (xy -20.740047 -30.697922) (xy -20.591651 -30.525982) (xy -20.427393 -30.412013) (xy -20.335356 -30.372677) (xy -20.225064 -30.340637) (xy -20.102267 -30.322053) (xy -19.954007 -30.317343)
     (xy -19.767326 -30.326926) (xy -19.529264 -30.351220) (xy -19.226864 -30.390642) (xy -19.064514 -30.413694) (xy -18.748261 -30.457625) (xy -18.442092 -30.496050) (xy -18.125746 -30.531119) (xy -17.778965 -30.564982)
     (xy -17.381489 -30.599790) (xy -17.076318 -30.624744) (xy -16.867703 -30.662405) (xy -16.669835 -30.744445) (xy -16.508814 -30.855018) (xy -14.715180 -30.855018) (xy -14.697795 -30.625788) (xy -14.653441 -30.445492)
     (xy -14.632998 -30.401075) (xy -14.464070 -30.162875) (xy -14.216096 -29.925301) (xy -13.886654 -29.686133) (xy -13.781981 -29.620111) (xy -13.590074 -29.497023) (xy -13.411429 -29.369340) (xy -13.240858 -29.230696)
     (xy -13.073172 -29.074724) (xy -12.903180 -28.895058) (xy -12.725695 -28.685332) (xy -12.535526 -28.439179) (xy -12.327485 -28.150232) (xy -12.096382 -27.812126) (xy -11.837029 -27.418493) (xy -11.544235 -26.962967)
     (xy -11.292994 -26.566446) (xy -11.076733 -26.226831) (xy -10.896585 -25.952276) (xy -10.746153 -25.734619) (xy -10.619039 -25.565698) (xy -10.508847 -25.437353) (xy -10.409178 -25.341421) (xy -10.313636 -25.269742)
     (xy -10.244666 -25.229026) (xy -10.056663 -25.167616) (xy -9.817021 -25.149318) (xy -9.546888 -25.173995) (xy -9.287263 -25.235259) (xy -9.085465 -25.306615) (xy -8.830892 -25.410106) (xy -8.544344 -25.535979)
     (xy -8.246624 -25.674478) (xy -7.958535 -25.815851) (xy -7.700879 -25.950342) (xy -7.494457 -26.068198) (xy -7.445919 -26.098666) (xy -7.021005 -26.422520) (xy -6.635608 -26.815091) (xy -6.293911 -27.268151)
     (xy -6.000098 -27.773474) (xy -5.758354 -28.322835) (xy -5.572863 -28.908006) (xy -5.447810 -29.520762) (xy -5.387707 -30.145127) (xy -5.398455 -30.777947) (xy -5.485813 -31.379661) (xy -5.648678 -31.947327)
     (xy -5.885947 -32.478005) (xy -6.196517 -32.968752) (xy -6.579282 -33.416628) (xy -6.636722 -33.473936) (xy -7.092149 -33.862091) (xy -7.592931 -34.183922) (xy -8.131022 -34.438805) (xy -8.698377 -34.626117)
     (xy -9.286949 -34.745235) (xy -9.888691 -34.795536) (xy -10.495559 -34.776396) (xy -11.099504 -34.687193) (xy -11.692482 -34.527303) (xy -12.266445 -34.296103) (xy -12.813348 -33.992970) (xy -12.869333 -33.956641)
     (xy -13.072583 -33.805665) (xy -13.302292 -33.607651) (xy -13.535784 -33.384511) (xy -13.750383 -33.158157) (xy -13.923411 -32.950501) (xy -13.955035 -32.907560) (xy -14.112698 -32.662103) (xy -14.276407 -32.364944)
     (xy -14.430981 -32.046344) (xy -14.561242 -31.736563) (xy -14.610014 -31.601833) (xy -14.670841 -31.366488) (xy -14.706046 -31.109734) (xy -14.715180 -30.855018) (xy -16.508814 -30.855018) (xy -16.477943 -30.876217)
     (xy -16.287258 -31.063074) (xy -16.093008 -31.310369) (xy -15.890423 -31.623453) (xy -15.674733 -32.007680) (xy -15.450882 -32.448500) (xy -15.242024 -32.893051) (xy -15.081124 -33.275041) (xy -14.966078 -33.600188)
     (xy -14.894784 -33.874212) (xy -14.871228 -34.024624) (xy -14.863405 -34.197351) (xy -14.893363 -34.304044) (xy -14.973345 -34.356403) (xy -15.115590 -34.366132) (xy -15.219996 -34.358048) (xy -15.480709 -34.319953)
     (xy -15.797077 -34.254908) (xy -16.160112 -34.166110) (xy -16.560824 -34.056757) (xy -16.990224 -33.930047) (xy -17.439321 -33.789178) (xy -17.899128 -33.637350) (xy -18.360653 -33.477759) (xy -18.814909 -33.313604)
     (xy -19.252905 -33.148083) (xy -19.665652 -32.984395) (xy -20.044160 -32.825736) (xy -20.379441 -32.675306) (xy -20.662504 -32.536303) (xy -20.884361 -32.411925) (xy -21.036021 -32.305370) (xy -21.065403 -32.278445)
     (xy -21.142610 -32.144442) (xy -21.172048 -31.953754) (xy -22.911477 -31.953754) (xy -22.914119 -31.961739) (xy -22.926652 -32.088408) (xy -22.907931 -32.208310) (xy -22.878343 -32.295045) (xy -22.798739 -32.437592)
     (xy -22.669712 -32.584559) (xy -22.486064 -32.739498) (xy -22.242595 -32.905960) (xy -21.934108 -33.087499) (xy -21.555405 -33.287665) (xy -21.101286 -33.510011) (xy -21.097519 -33.511801) (xy -19.873987 -34.049714)
     (xy -18.598490 -34.526492) (xy -17.280416 -34.939349) (xy -15.929151 -35.285499) (xy -14.554082 -35.562154) (xy -13.772780 -35.686315) (xy -13.155109 -35.764396) (xy -12.514689 -35.825577) (xy -11.868993 -35.869160)
     (xy -11.235495 -35.894446) (xy -10.631666 -35.900737) (xy -10.074981 -35.887333) )(layer F.Cu) (width  0.010000)
  )
  (fp_poly (pts (xy 26.425173 6.234849) (xy 26.935838 6.243037) (xy 27.378052 6.253424) (xy 27.768022 6.267150) (xy 28.121956 6.285359) (xy 28.456064 6.309193) (xy 28.786552 6.339794) (xy 29.129630 6.378305)
     (xy 29.501505 6.425867) (xy 29.882203 6.478488) (xy 30.713892 6.609902) (xy 31.513792 6.763250) (xy 32.275081 6.936453) (xy 32.990933 7.127431) (xy 33.654524 7.334105) (xy 34.259032 7.554394)
     (xy 34.797631 7.786220) (xy 35.263499 8.027503) (xy 35.549674 8.205655) (xy 35.821306 8.424395) (xy 36.106484 8.717025) (xy 36.400732 9.074708) (xy 36.699577 9.488604) (xy 36.998546 9.949878)
     (xy 37.293163 10.449692) (xy 37.578956 10.979208) (xy 37.851450 11.529589) (xy 38.106172 12.091996) (xy 38.338647 12.657594) (xy 38.544402 13.217544) (xy 38.718962 13.763009) (xy 38.857853 14.285151)
     (xy 38.956602 14.775133) (xy 38.988749 14.998917) (xy 39.011310 15.325130) (xy 38.988081 15.592083) (xy 38.914906 15.814238) (xy 38.787626 16.006059) (xy 38.663411 16.130647) (xy 38.422118 16.319281)
     (xy 38.108515 16.526774) (xy 37.731692 16.748706) (xy 37.300743 16.980656) (xy 36.824759 17.218205) (xy 36.312832 17.456930) (xy 35.774056 17.692414) (xy 35.217521 17.920234) (xy 34.652320 18.135970)
     (xy 34.226500 18.287770) (xy 33.638921 18.481334) (xy 33.015767 18.669938) (xy 32.386893 18.845174) (xy 31.782159 18.998634) (xy 31.362238 19.094417) (xy 30.725155 19.242970) (xy 30.169417 19.397541)
     (xy 29.691839 19.559286) (xy 29.289238 19.729360) (xy 28.958430 19.908921) (xy 28.778204 20.032941) (xy 28.577667 20.164997) (xy 28.308797 20.310851) (xy 27.985749 20.465204) (xy 27.622677 20.622760)
     (xy 27.233733 20.778224) (xy 26.833073 20.926298) (xy 26.434848 21.061686) (xy 26.053214 21.179092) (xy 25.702323 21.273219) (xy 25.396330 21.338771) (xy 25.220084 21.364432) (xy 25.080786 21.375707)
     (xy 25.006506 21.369539) (xy 24.978828 21.342877) (xy 24.976667 21.324112) (xy 25.013709 21.226453) (xy 25.123983 21.089963) (xy 25.306213 20.916020) (xy 25.521138 20.736220) (xy 25.733705 20.560460)
     (xy 25.883320 20.422235) (xy 25.977898 20.312755) (xy 26.025354 20.223229) (xy 26.034790 20.165779) (xy 26.023023 20.102096) (xy 25.978192 20.060367) (xy 25.886527 20.036332) (xy 25.734260 20.025733)
     (xy 25.576454 20.024035) (xy 25.332208 20.039003) (xy 25.013772 20.082764) (xy 24.626201 20.154305) (xy 24.174550 20.252609) (xy 23.663875 20.376662) (xy 23.156334 20.509932) (xy 22.528760 20.677987)
     (xy 21.981166 20.820488) (xy 21.512863 20.937600) (xy 21.123164 21.029487) (xy 20.811382 21.096311) (xy 20.576828 21.138237) (xy 20.457584 21.152913) (xy 20.299111 21.164603) (xy 20.207028 21.163880)
     (xy 20.163570 21.147613) (xy 20.150969 21.112670) (xy 20.150551 21.098795) (xy 20.180704 21.040198) (xy 20.265868 20.934210) (xy 20.397963 20.789901) (xy 20.568909 20.616342) (xy 20.655783 20.531667)
     (xy 20.876119 20.314592) (xy 21.036119 20.143637) (xy 21.140475 20.010702) (xy 21.193881 19.907688) (xy 21.201030 19.826498) (xy 21.166614 19.759033) (xy 21.126026 19.720191) (xy 21.019129 19.667019)
     (xy 20.863414 19.643724) (xy 20.654929 19.651059) (xy 20.389720 19.689771) (xy 20.063834 19.760613) (xy 19.673319 19.864334) (xy 19.214221 20.001683) (xy 18.682588 20.173412) (xy 18.609555 20.197762)
     (xy 18.158606 20.346939) (xy 17.777893 20.468802) (xy 17.458310 20.565595) (xy 17.190756 20.639565) (xy 16.966124 20.692956) (xy 16.775313 20.728013) (xy 16.609217 20.746982) (xy 16.458734 20.752108)
     (xy 16.372417 20.749487) (xy 16.275974 20.725900) (xy 16.250021 20.668375) (xy 16.295374 20.575929) (xy 16.412850 20.447579) (xy 16.603268 20.282342) (xy 16.867443 20.079234) (xy 17.023659 19.965876)
     (xy 17.273129 19.777899) (xy 17.492286 19.593909) (xy 17.672638 19.422500) (xy 17.805696 19.272268) (xy 17.882970 19.151807) (xy 17.898601 19.080196) (xy 17.840520 18.969928) (xy 17.706649 18.883204)
     (xy 17.502866 18.821225) (xy 17.235045 18.785193) (xy 16.909065 18.776311) (xy 16.530800 18.795781) (xy 16.514934 18.797143) (xy 16.148271 18.834276) (xy 15.801685 18.881531) (xy 15.450896 18.943236)
     (xy 15.071620 19.023718) (xy 14.639577 19.127304) (xy 14.583834 19.141291) (xy 14.142547 19.243774) (xy 13.776702 19.309741) (xy 13.485357 19.339199) (xy 13.267568 19.332151) (xy 13.122394 19.288605)
     (xy 13.048890 19.208564) (xy 13.038667 19.150294) (xy 13.053774 19.057621) (xy 13.103090 18.954167) (xy 13.192609 18.833473) (xy 13.328325 18.689079) (xy 13.516230 18.514527) (xy 13.762319 18.303359)
     (xy 14.024314 18.088149) (xy 14.195820 17.947164) (xy 14.339458 17.825189) (xy 14.444344 17.731780) (xy 14.499595 17.676496) (xy 14.505053 17.665942) (xy 14.458998 17.665027) (xy 14.339376 17.673073)
     (xy 14.156684 17.688946) (xy 13.921418 17.711513) (xy 13.644075 17.739641) (xy 13.335150 17.772197) (xy 13.005141 17.808046) (xy 12.664542 17.846056) (xy 12.323852 17.885094) (xy 11.993565 17.924025)
     (xy 11.684179 17.961717) (xy 11.406189 17.997036) (xy 11.264565 18.015840) (xy 10.947089 18.061223) (xy 10.606161 18.114070) (xy 10.260989 18.171060) (xy 9.930780 18.228871) (xy 9.634741 18.284180)
     (xy 9.392080 18.333666) (xy 9.281584 18.358820) (xy 9.211987 18.367245) (xy 9.183981 18.347141) (xy 9.200512 18.295276) (xy 9.264526 18.208419) (xy 9.378970 18.083341) (xy 9.546791 17.916809)
     (xy 9.770935 17.705594) (xy 10.054349 17.446464) (xy 10.382290 17.151972) (xy 10.616258 16.939926) (xy 10.785074 16.779445) (xy 10.889846 16.669386) (xy 10.931680 16.608606) (xy 10.921856 16.594667)
     (xy 10.854966 16.601121) (xy 10.713937 16.619523) (xy 10.508231 16.648434) (xy 10.247309 16.686417) (xy 9.940635 16.732031) (xy 9.597671 16.783838) (xy 9.227878 16.840400) (xy 8.840719 16.900276)
     (xy 8.445656 16.962030) (xy 8.052152 17.024220) (xy 7.669668 17.085410) (xy 7.307668 17.144160) (xy 7.300249 17.145374) (xy 6.858181 17.215583) (xy 6.493653 17.268449) (xy 6.201416 17.304354)
     (xy 5.976218 17.323678) (xy 5.812810 17.326802) (xy 5.705940 17.314106) (xy 5.650358 17.285973) (xy 5.640064 17.265780) (xy 5.659814 17.183725) (xy 5.734141 17.067596) (xy 5.848923 16.932806)
     (xy 5.990039 16.794766) (xy 6.143366 16.668890) (xy 6.257371 16.592043) (xy 6.598894 16.417325) (xy 7.012165 16.261337) (xy 7.501590 16.122564) (xy 7.857154 16.042014) (xy 8.307691 15.941629)
     (xy 8.684750 15.841542) (xy 8.999371 15.737066) (xy 9.262596 15.623508) (xy 9.485467 15.496179) (xy 9.679023 15.350389) (xy 9.835128 15.201782) (xy 9.991529 15.017112) (xy 10.134177 14.801541)
     (xy 10.269680 14.542264) (xy 10.292847 14.488057) (xy 11.563841 14.488057) (xy 11.589944 14.563375) (xy 11.661680 14.645979) (xy 11.717903 14.698181) (xy 11.913817 14.851479) (xy 12.184277 15.026536)
     (xy 12.522883 15.220283) (xy 12.923235 15.429653) (xy 13.378936 15.651577) (xy 13.883585 15.882987) (xy 14.430783 16.120816) (xy 15.014131 16.361994) (xy 15.627229 16.603454) (xy 15.937497 16.721290)
     (xy 16.627150 16.972041) (xy 17.305395 17.201514) (xy 17.990305 17.415036) (xy 18.699955 17.617934) (xy 19.452418 17.815535) (xy 20.265769 18.013168) (xy 20.524181 18.073222) (xy 21.355026 18.256113)
     (xy 22.120307 18.406152) (xy 22.831962 18.524570) (xy 23.501929 18.612598) (xy 24.142147 18.671468) (xy 24.764553 18.702412) (xy 25.381087 18.706661) (xy 26.003686 18.685446) (xy 26.289000 18.667922)
     (xy 26.752504 18.628940) (xy 27.277984 18.573002) (xy 27.845119 18.503034) (xy 28.433586 18.421962) (xy 29.023064 18.332710) (xy 29.593228 18.238205) (xy 30.123758 18.141373) (xy 30.553832 18.053944)
     (xy 31.198009 17.906835) (xy 31.843971 17.744058) (xy 32.485804 17.567947) (xy 33.117592 17.380834) (xy 33.733421 17.185054) (xy 34.327375 16.982938) (xy 34.893541 16.776821) (xy 35.426002 16.569035)
     (xy 35.918845 16.361913) (xy 36.366154 16.157788) (xy 36.762015 15.958994) (xy 37.100512 15.767864) (xy 37.375731 15.586731) (xy 37.581756 15.417927) (xy 37.712674 15.263787) (xy 37.736411 15.220768)
     (xy 37.782692 15.082168) (xy 37.798509 14.917837) (xy 37.782172 14.719652) (xy 37.731992 14.479492) (xy 37.646280 14.189231) (xy 37.523346 13.840749) (xy 37.364933 13.434430) (xy 37.173553 12.968980)
     (xy 37.003948 12.578621) (xy 36.852430 12.257694) (xy 36.715312 12.000542) (xy 36.588906 11.801508) (xy 36.469525 11.654933) (xy 36.353481 11.555161) (xy 36.237087 11.496534) (xy 36.116656 11.473394)
     (xy 36.086158 11.472492) (xy 36.009837 11.484429) (xy 35.865685 11.518023) (xy 35.666727 11.569809) (xy 35.425985 11.636323) (xy 35.156482 11.714099) (xy 34.976215 11.767795) (xy 34.458753 11.921429)
     (xy 33.972867 12.059934) (xy 33.510972 12.184351) (xy 33.065481 12.295717) (xy 32.628807 12.395072) (xy 32.193362 12.483455) (xy 31.751561 12.561906) (xy 31.295816 12.631463) (xy 30.818540 12.693165)
     (xy 30.312147 12.748052) (xy 29.769050 12.797163) (xy 29.181662 12.841536) (xy 28.542396 12.882211) (xy 27.843665 12.920228) (xy 27.077883 12.956624) (xy 26.237462 12.992440) (xy 25.950334 13.003995)
     (xy 25.637904 13.014585) (xy 25.256184 13.024512) (xy 24.820548 13.033544) (xy 24.346372 13.041447) (xy 23.849031 13.047986) (xy 23.343901 13.052929) (xy 22.846355 13.056041) (xy 22.457834 13.057062)
     (xy 21.876970 13.056658) (xy 21.371053 13.054093) (xy 20.930374 13.048795) (xy 20.545227 13.040189) (xy 20.205906 13.027704) (xy 19.902705 13.010767) (xy 19.625916 12.988804) (xy 19.365834 12.961242)
     (xy 19.112751 12.927510) (xy 18.856962 12.887033) (xy 18.588760 12.839239) (xy 18.506950 12.823867) (xy 17.986271 12.713554) (xy 17.431608 12.575413) (xy 16.867366 12.416638) (xy 16.317951 12.244423)
     (xy 15.807767 12.065964) (xy 15.423349 11.914806) (xy 15.202495 11.819768) (xy 15.030419 11.737057) (xy 14.881857 11.651447) (xy 14.731543 11.547712) (xy 14.554210 11.410626) (xy 14.456834 11.332357)
     (xy 14.193689 11.139769) (xy 13.951328 11.002386) (xy 13.740210 10.925497) (xy 13.622330 10.910455) (xy 13.500168 10.927045) (xy 13.379350 10.980588) (xy 13.255562 11.076742) (xy 13.124489 11.221163)
     (xy 12.981817 11.419510) (xy 12.823231 11.677440) (xy 12.644416 12.000610) (xy 12.441057 12.394679) (xy 12.347780 12.581700) (xy 12.117860 13.053557) (xy 11.926819 13.460938) (xy 11.775432 13.802038)
     (xy 11.664477 14.075052) (xy 11.594732 14.278174) (xy 11.568977 14.390261) (xy 11.563841 14.488057) (xy 10.292847 14.488057) (xy 10.404646 14.226477) (xy 10.545683 13.841373) (xy 10.562581 13.792091)
     (xy 10.942750 12.763020) (xy 11.357111 11.805628) (xy 11.804736 10.921751) (xy 12.284699 10.113221) (xy 12.787041 9.393754) (xy 12.838125 9.331343) (xy 14.736485 9.331343) (xy 14.758796 9.423350)
     (xy 14.778768 9.443970) (xy 14.822602 9.470676) (xy 14.859327 9.475896) (xy 14.916288 9.454619) (xy 15.020831 9.401830) (xy 15.027661 9.398343) (xy 15.158106 9.314733) (xy 15.302887 9.195845)
     (xy 15.442984 9.060623) (xy 15.559376 8.928010) (xy 15.633044 8.816952) (xy 15.646493 8.782003) (xy 15.643019 8.659511) (xy 15.570962 8.578017) (xy 15.454771 8.551334) (xy 15.331303 8.580588)
     (xy 15.179539 8.656938) (xy 15.026363 8.763266) (xy 14.898662 8.882454) (xy 14.861173 8.929282) (xy 14.791793 9.058582) (xy 14.748857 9.201178) (xy 14.736485 9.331343) (xy 12.838125 9.331343)
     (xy 13.107725 9.001968) (xy 13.470273 8.612077) (xy 13.604275 8.483433) (xy 17.991667 8.483433) (xy 17.996556 8.567987) (xy 18.015393 8.653046) (xy 18.054433 8.750834) (xy 18.119930 8.873576)
     (xy 18.218139 9.033495) (xy 18.355314 9.242815) (xy 18.460117 9.398973) (xy 18.720202 9.800957) (xy 18.936217 10.169250) (xy 19.105239 10.497828) (xy 19.224345 10.780673) (xy 19.290612 11.011761)
     (xy 19.304000 11.137046) (xy 19.343475 11.279438) (xy 19.452432 11.419079) (xy 19.616667 11.540361) (xy 19.715773 11.589538) (xy 19.900263 11.651011) (xy 20.153858 11.710232) (xy 20.461001 11.764518)
     (xy 20.806130 11.811189) (xy 21.173688 11.847564) (xy 21.245805 11.853166) (xy 21.418336 11.861845) (xy 21.664044 11.868345) (xy 21.971466 11.872764) (xy 22.329144 11.875195) (xy 22.725618 11.875732)
     (xy 23.149425 11.874472) (xy 23.589107 11.871508) (xy 24.033204 11.866935) (xy 24.470253 11.860849) (xy 24.888797 11.853343) (xy 25.277373 11.844513) (xy 25.624523 11.834453) (xy 25.918784 11.823259)
     (xy 26.119667 11.812866) (xy 26.936397 11.759203) (xy 27.718066 11.700909) (xy 28.455107 11.638849) (xy 29.137955 11.573888) (xy 29.757044 11.506893) (xy 30.302809 11.438729) (xy 30.395334 11.426009)
     (xy 31.029779 11.328228) (xy 31.647034 11.215345) (xy 32.240898 11.089417) (xy 32.805171 10.952501) (xy 33.333651 10.806653) (xy 33.820139 10.653930) (xy 34.258433 10.496390) (xy 34.642332 10.336090)
     (xy 34.965637 10.175087) (xy 35.222146 10.015437) (xy 35.405658 9.859198) (xy 35.498317 9.733154) (xy 35.541384 9.622951) (xy 35.533882 9.527568) (xy 35.515785 9.478125) (xy 35.412390 9.323603)
     (xy 35.231215 9.162454) (xy 34.978707 8.996672) (xy 34.661313 8.828252) (xy 34.285480 8.659189) (xy 33.857654 8.491478) (xy 33.384283 8.327115) (xy 32.871812 8.168095) (xy 32.326690 8.016412)
     (xy 31.755362 7.874062) (xy 31.164275 7.743039) (xy 30.559876 7.625340) (xy 29.948612 7.522959) (xy 29.336930 7.437890) (xy 28.731277 7.372130) (xy 28.702000 7.369451) (xy 27.979846 7.315220)
     (xy 27.190832 7.276360) (xy 26.351334 7.252738) (xy 25.477728 7.244218) (xy 24.586389 7.250666) (xy 23.693693 7.271949) (xy 22.816014 7.307932) (xy 21.969729 7.358480) (xy 21.171213 7.423459)
     (xy 21.082000 7.431966) (xy 20.501988 7.493041) (xy 19.999938 7.556963) (xy 19.569153 7.625414) (xy 19.202936 7.700074) (xy 18.894592 7.782624) (xy 18.637421 7.874747) (xy 18.424729 7.978122)
     (xy 18.249819 8.094431) (xy 18.168617 8.163302) (xy 18.061702 8.272526) (xy 18.008217 8.363062) (xy 17.991912 8.464315) (xy 17.991667 8.483433) (xy 13.604275 8.483433) (xy 13.856190 8.241592)
     (xy 14.246978 7.908020) (xy 14.624141 7.628871) (xy 14.713708 7.569913) (xy 15.022267 7.390011) (xy 15.344645 7.239788) (xy 15.697377 7.113545) (xy 16.096997 7.005589) (xy 16.560041 6.910222)
     (xy 16.700500 6.885479) (xy 17.410824 6.774704) (xy 18.193349 6.671825) (xy 19.035907 6.577656) (xy 19.926328 6.493013) (xy 20.852444 6.418708) (xy 21.802085 6.355556) (xy 22.763084 6.304371)
     (xy 23.723271 6.265967) (xy 24.670478 6.241159) (xy 25.592536 6.230761) (xy 26.425173 6.234849) )(layer F.Cu) (width  0.010000)
  )
  (fp_poly (pts (xy 33.503065 20.213804) (xy 33.722938 20.244882) (xy 33.878797 20.291818) (xy 33.951786 20.341712) (xy 33.968260 20.416550) (xy 33.906946 20.500713) (xy 33.773788 20.590977) (xy 33.574728 20.684120)
     (xy 33.315712 20.776919) (xy 33.002681 20.866151) (xy 32.968823 20.874707) (xy 32.723375 20.930569) (xy 32.451115 20.983258) (xy 32.163948 21.031447) (xy 31.873779 21.073807) (xy 31.592515 21.109012)
     (xy 31.332060 21.135732) (xy 31.104321 21.152641) (xy 30.921203 21.158409) (xy 30.794612 21.151710) (xy 30.736453 21.131216) (xy 30.734000 21.123964) (xy 30.768253 21.052003) (xy 30.860352 20.951651)
     (xy 30.994304 20.835952) (xy 31.154121 20.717948) (xy 31.323810 20.610681) (xy 31.437658 20.550052) (xy 31.834651 20.387750) (xy 32.253835 20.278416) (xy 32.716965 20.216965) (xy 32.914167 20.204881)
     (xy 33.229901 20.200000) (xy 33.503065 20.213804) )(layer F.Cu) (width  0.010000)
  )
  (fp_poly (pts (xy -3.829859 -12.919541) (xy -3.793308 -12.897324) (xy -3.705876 -12.798508) (xy -3.686223 -12.671952) (xy -3.727197 -12.529335) (xy -3.821643 -12.382332) (xy -3.962410 -12.242620) (xy -4.142342 -12.121877)
     (xy -4.315646 -12.044664) (xy -4.484122 -12.001092) (xy -4.654346 -11.982879) (xy -4.800107 -11.990631) (xy -4.895191 -12.024953) (xy -4.902200 -12.031133) (xy -4.946689 -12.129420) (xy -4.944587 -12.267563)
     (xy -4.898733 -12.416677) (xy -4.856951 -12.491339) (xy -4.707621 -12.650733) (xy -4.498949 -12.788589) (xy -4.256004 -12.889896) (xy -4.141417 -12.919721) (xy -3.997411 -12.945475) (xy -3.903880 -12.946079)
     (xy -3.829859 -12.919541) )(layer F.Cu) (width  0.010000)
  )
  (fp_poly (pts (xy -15.845546 -25.640847) (xy -15.763909 -25.567777) (xy -15.690576 -25.439151) (xy -15.638638 -25.283943) (xy -15.621000 -25.143783) (xy -15.643510 -24.986186) (xy -15.701659 -24.833917) (xy -15.781372 -24.718513)
     (xy -15.826300 -24.683741) (xy -15.987060 -24.641615) (xy -16.153598 -24.668941) (xy -16.192500 -24.687287) (xy -16.377268 -24.824001) (xy -16.486092 -24.983085) (xy -16.516890 -25.155475) (xy -16.467578 -25.332102)
     (xy -16.371742 -25.467442) (xy -16.220351 -25.589865) (xy -16.053449 -25.655582) (xy -15.894506 -25.656859) (xy -15.845546 -25.640847) )(layer F.Cu) (width  0.010000)
  )
  (fp_poly (pts (xy -10.378683 -28.874132) (xy -10.370809 -28.870978) (xy -10.233673 -28.786962) (xy -10.121090 -28.669559) (xy -10.052405 -28.543085) (xy -10.041342 -28.456858) (xy -10.094330 -28.341015) (xy -10.208287 -28.247524)
     (xy -10.360607 -28.185184) (xy -10.528684 -28.162797) (xy -10.689911 -28.189163) (xy -10.709463 -28.196746) (xy -10.870830 -28.292335) (xy -10.950859 -28.407942) (xy -10.948718 -28.540813) (xy -10.863576 -28.688199)
     (xy -10.859357 -28.693261) (xy -10.703565 -28.832897) (xy -10.540750 -28.894130) (xy -10.378683 -28.874132) )(layer F.Cu) (width  0.010000)
  )
  (fp_poly (pts (xy 30.406753 14.329380) (xy 30.541965 14.470647) (xy 30.684164 14.692590) (xy 30.779128 14.880167) (xy 30.913819 15.203676) (xy 31.021445 15.533825) (xy 31.098895 15.854743) (xy 31.143057 16.150560)
     (xy 31.150822 16.405407) (xy 31.119078 16.603414) (xy 31.117736 16.607545) (xy 31.026016 16.780725) (xy 30.892461 16.901985) (xy 30.734647 16.964240) (xy 30.570152 16.960406) (xy 30.422179 16.887904)
     (xy 30.281679 16.732816) (xy 30.157411 16.510041) (xy 30.053240 16.235652) (xy 29.973032 15.925721) (xy 29.920653 15.596321) (xy 29.899968 15.263522) (xy 29.914844 14.943398) (xy 29.929085 14.837834)
     (xy 29.989253 14.573727) (xy 30.069778 14.390961) (xy 30.167986 14.289404) (xy 30.281202 14.268921) (xy 30.406753 14.329380) )(layer F.Cu) (width  0.010000)
  )
)
