EESchema Schematic File Version 4
LIBS:fuizler-cache
EELAYER 26 0
EELAYER END
$Descr A4 11693 8268
encoding utf-8
Sheet 1 1
Title "Fuizler"
Date "2020-03-11"
Rev "0.0.1"
Comp "RE:lint"
Comment1 ""
Comment2 ""
Comment3 ""
Comment4 ""
$EndDescr
$Comp
L MCU_Microchip_ATtiny:ATtiny85-20PU U2
U 1 1 5E691085
P 3850 2650
F 0 "U2" H 3320 2696 50  0000 R CNN
F 1 "ATtiny85-20PU" H 3320 2605 50  0000 R CNN
F 2 "Package_DIP:DIP-8_W7.62mm" H 3850 2650 50  0001 C CIN
F 3 "http://ww1.microchip.com/downloads/en/DeviceDoc/atmel-2586-avr-8-bit-microcontroller-attiny25-attiny45-attiny85_datasheet.pdf" H 3850 2650 50  0001 C CNN
	1    3850 2650
	1    0    0    -1  
$EndComp
$Comp
L Device:LED D1
U 1 1 5E691131
P 5400 1350
F 0 "D1" H 5391 1566 50  0000 C CNN
F 1 "LED" H 5391 1475 50  0000 C CNN
F 2 "LED_THT:LED_D5.0mm" H 5400 1350 50  0001 C CNN
F 3 "~" H 5400 1350 50  0001 C CNN
	1    5400 1350
	-1   0    0    1   
$EndComp
$Comp
L Device:LED D2
U 1 1 5E69121B
P 5400 1750
F 0 "D2" H 5391 1966 50  0000 C CNN
F 1 "LED" H 5391 1875 50  0000 C CNN
F 2 "LED_THT:LED_D5.0mm" H 5400 1750 50  0001 C CNN
F 3 "~" H 5400 1750 50  0001 C CNN
	1    5400 1750
	-1   0    0    1   
$EndComp
$Comp
L Device:LED D3
U 1 1 5E691246
P 5400 2100
F 0 "D3" H 5391 2316 50  0000 C CNN
F 1 "LED" H 5391 2225 50  0000 C CNN
F 2 "LED_THT:LED_D5.0mm" H 5400 2100 50  0001 C CNN
F 3 "~" H 5400 2100 50  0001 C CNN
	1    5400 2100
	-1   0    0    1   
$EndComp
$Comp
L Device:LED D4
U 1 1 5E691291
P 5400 2450
F 0 "D4" H 5391 2666 50  0000 C CNN
F 1 "LED" H 5391 2575 50  0000 C CNN
F 2 "LED_THT:LED_D5.0mm" H 5400 2450 50  0001 C CNN
F 3 "~" H 5400 2450 50  0001 C CNN
	1    5400 2450
	-1   0    0    1   
$EndComp
$Comp
L Device:R R2
U 1 1 5E69145B
P 5100 1350
F 0 "R2" V 4893 1350 50  0000 C CNN
F 1 "R" V 4984 1350 50  0000 C CNN
F 2 "Resistor_THT:R_Axial_DIN0309_L9.0mm_D3.2mm_P12.70mm_Horizontal" V 5030 1350 50  0001 C CNN
F 3 "~" H 5100 1350 50  0001 C CNN
	1    5100 1350
	0    1    1    0   
$EndComp
$Comp
L Device:R R3
U 1 1 5E6914DA
P 5100 1750
F 0 "R3" V 4893 1750 50  0000 C CNN
F 1 "R" V 4984 1750 50  0000 C CNN
F 2 "Resistor_THT:R_Axial_DIN0309_L9.0mm_D3.2mm_P12.70mm_Horizontal" V 5030 1750 50  0001 C CNN
F 3 "~" H 5100 1750 50  0001 C CNN
	1    5100 1750
	0    1    1    0   
$EndComp
$Comp
L Device:R R4
U 1 1 5E6914F5
P 5100 2100
F 0 "R4" V 4893 2100 50  0000 C CNN
F 1 "R" V 4984 2100 50  0000 C CNN
F 2 "Resistor_THT:R_Axial_DIN0309_L9.0mm_D3.2mm_P12.70mm_Horizontal" V 5030 2100 50  0001 C CNN
F 3 "~" H 5100 2100 50  0001 C CNN
	1    5100 2100
	0    1    1    0   
$EndComp
$Comp
L Device:R R5
U 1 1 5E691510
P 5100 2450
F 0 "R5" V 4893 2450 50  0000 C CNN
F 1 "R" V 4984 2450 50  0000 C CNN
F 2 "Resistor_THT:R_Axial_DIN0309_L9.0mm_D3.2mm_P12.70mm_Horizontal" V 5030 2450 50  0001 C CNN
F 3 "~" H 5100 2450 50  0001 C CNN
	1    5100 2450
	0    1    1    0   
$EndComp
Wire Wire Line
	4450 2350 4450 1350
Wire Wire Line
	4450 1350 4950 1350
Wire Wire Line
	4450 2450 4600 2450
Wire Wire Line
	4600 2450 4600 1750
Wire Wire Line
	4600 1750 4950 1750
Wire Wire Line
	4450 2550 4750 2550
Wire Wire Line
	4750 2550 4750 2100
Wire Wire Line
	4750 2100 4950 2100
Wire Wire Line
	4450 2650 4950 2650
Wire Wire Line
	4950 2650 4950 2450
Wire Wire Line
	3850 3250 3850 3400
Wire Wire Line
	3850 3400 5550 3400
Wire Wire Line
	5550 3400 5550 2450
Connection ~ 5550 1750
Wire Wire Line
	5550 1750 5550 1350
Connection ~ 5550 2100
Wire Wire Line
	5550 2100 5550 1750
Connection ~ 5550 2450
Wire Wire Line
	5550 2450 5550 2100
$Comp
L 1825910-7:1825910-7 S1
U 1 1 5E691461
P 4250 3900
F 0 "S1" H 4250 4267 50  0000 C CNN
F 1 "1825910-7" H 4250 4176 50  0000 C CNN
F 2 "1825910-7:SW_1825910-7" H 4250 3900 50  0001 L BNN
F 3 "TE Connectivity" H 4250 3900 50  0001 L BNN
F 4 "https://www.te.com/usa-en/product-1825910-7.html?te_bu=Cor&te_type=disp&te_campaign=seda_glo_cor-seda-global-disp-prtnr-fy19-seda-model-bom-cta_sma-317_1&elqCampaignId=32493" H 4250 3900 50  0001 L BNN "Feld4"
F 5 "None" H 4250 3900 50  0001 L BNN "Feld5"
F 6 "Switch Tactile OFF _ON_ SPST Round Button PC Pins 0.05A 24VDC 100000Cycle 2.55N Thru-Hole Loose Piece" H 4250 3900 50  0001 L BNN "Feld6"
F 7 "1825910-7" H 4250 3900 50  0001 L BNN "Feld7"
F 8 "Unavailable" H 4250 3900 50  0001 L BNN "Feld8"
F 9 "None" H 4250 3900 50  0001 L BNN "Feld9"
F 10 "1825910-7" H 4250 3900 50  0001 L BNN "Feld10"
	1    4250 3900
	1    0    0    -1  
$EndComp
Wire Wire Line
	3850 2050 2500 2050
Wire Wire Line
	4650 3800 4650 2750
Wire Wire Line
	4650 2750 4450 2750
Wire Wire Line
	2500 4000 3850 4000
$Comp
L Device:R R1
U 1 1 5E691CDB
P 3850 3650
F 0 "R1" H 3920 3696 50  0000 L CNN
F 1 "R" H 3920 3605 50  0000 L CNN
F 2 "Resistor_THT:R_Axial_DIN0309_L9.0mm_D3.2mm_P12.70mm_Horizontal" V 3780 3650 50  0001 C CNN
F 3 "~" H 3850 3650 50  0001 C CNN
	1    3850 3650
	1    0    0    -1  
$EndComp
Wire Wire Line
	3850 3500 3850 3400
Connection ~ 3850 3400
$Comp
L BAT-HLD-001:BAT-HLD-001 U1
U 1 1 5E692320
P 1800 2900
F 0 "U1" H 1800 2900 50  0001 L BNN
F 1 "BAT-HLD-001" H 1800 2900 50  0001 L BNN
F 2 "BAT-HLD-001:BAT-HLD-001" H 1800 2900 50  0001 L BNN
F 3 "None" H 1800 2900 50  0001 L BNN
F 4 "None" H 1800 2900 50  0001 L BNN "Feld4"
F 5 "BAT-HLD-001-TR" H 1800 2900 50  0001 L BNN "Feld5"
F 6 "Unavailable" H 1800 2900 50  0001 L BNN "Feld6"
F 7 "Linx Technologies" H 1800 2900 50  0001 L BNN "Feld7"
F 8 "CR2032 Battery Holder Surface Mount Tape and Reel" H 1800 2900 50  0001 L BNN "Feld8"
	1    1800 2900
	1    0    0    -1  
$EndComp
Wire Wire Line
	1800 3100 3200 3100
Wire Wire Line
	3200 3100 3200 3400
Wire Wire Line
	3200 3400 3850 3400
$Comp
L PCM12SMTR:PCM12SMTR SW1
U 1 1 5E692A7A
P 2000 2250
F 0 "SW1" V 1954 2478 50  0000 L CNN
F 1 "PCM12SMTR" V 2045 2478 50  0000 L CNN
F 2 "PCM12SMTR:SW_PCM12SMTR" H 2000 2250 50  0001 L BNN
F 3 "https://www.digikey.de/product-detail/en/c-k/PCM12SMTR/401-2016-1-ND/1640125?utm_source=snapeda&utm_medium=aggregator&utm_campaign=symbol" H 2000 2250 50  0001 L BNN
F 4 "DO-201 C&amp;K Components" H 2000 2250 50  0001 L BNN "Feld4"
F 5 "PCM12SMTR" H 2000 2250 50  0001 L BNN "Feld5"
F 6 "401-2016-1-ND" H 2000 2250 50  0001 L BNN "Feld6"
F 7 "Switch Slide ON ON SPDT Side Slide 0.3A 6VDC 10000Cycles Gull Wing SMD T/R" H 2000 2250 50  0001 L BNN "Feld7"
F 8 "C&K" H 2000 2250 50  0001 L BNN "Feld8"
	1    2000 2250
	0    1    1    0   
$EndComp
Wire Wire Line
	2500 2050 2500 4000
Wire Wire Line
	1800 2800 2000 2800
Wire Wire Line
	2000 2800 2000 2650
Wire Wire Line
	1900 1850 1900 1700
Wire Wire Line
	1900 1700 3850 1700
Wire Wire Line
	3850 1700 3850 2050
Connection ~ 3850 2050
$EndSCHEMATC
