{
  "files": {
    "main.css": "/static/css/main.af861a22.chunk.css",
    "main.js": "/static/js/main.8bc726c1.chunk.js",
    "main.js.map": "/static/js/main.8bc726c1.chunk.js.map",
    "runtime-main.js": "/static/js/runtime-main.adf35b26.js",
    "runtime-main.js.map": "/static/js/runtime-main.adf35b26.js.map",
    "static/js/2.2f1ba13f.chunk.js": "/static/js/2.2f1ba13f.chunk.js",
    "static/js/2.2f1ba13f.chunk.js.map": "/static/js/2.2f1ba13f.chunk.js.map",
    "static/js/3.690584a4.chunk.js": "/static/js/3.690584a4.chunk.js",
    "static/js/3.690584a4.chunk.js.map": "/static/js/3.690584a4.chunk.js.map",
    "index.html": "/index.html",
    "static/css/main.af861a22.chunk.css.map": "/static/css/main.af861a22.chunk.css.map",
    "static/js/2.2f1ba13f.chunk.js.LICENSE.txt": "/static/js/2.2f1ba13f.chunk.js.LICENSE.txt"
  },
  "entrypoints": [
    "static/js/runtime-main.adf35b26.js",
    "static/js/2.2f1ba13f.chunk.js",
    "static/css/main.af861a22.chunk.css",
    "static/js/main.8bc726c1.chunk.js"
  ]
}