1 10 20
100 200 125
201 210 89
900 1000 174
1000 1400 182
16037 841569 525
406211 875064 525
458145 694130 509
24341 656088 509
235240 839287 525
198900 926971 525
185084 732571 509
381289 500528 449
373008 947216 525
386760 879251 525
164371 621535 470
79998 863789 525
219972 832689 509
189408 940461 525
229819 523094 470
466690 748368 509
373696 891824 525
119623 850522 525
81751 661018 509
17690 834271 509
497063 720864 509
258249 698986 509
464188 642982 509
198437 839116 525
101406 589147 470
229924 767663 509
219771 826573 509
142466 958608 525
157497 833192 509
396245 889503 525
368057 881455 525
149522 745065 509
284889 773363 509
106296 883349 525
445812 626314 470
216333 946744 525
356926 978865 525
157723 824728 509
130471 857303 525
174659 736161 509
457706 906327 525
14003 681247 509
230854 659393 509
149921 892164 525
488340 563041 470
292017 872987 525
441802 943655 525
114500 729834 509
227034 737756 509
109681 675515 509
361132 842863 525
132070 735364 509
333298 792106 509
71874 967691 525
145951 748053 509
211995 607919 470
151114 743850 509
297484 899340 525
415169 965194 525
303021 919944 525
26273 597290 470
292609 984790 525
52926 910985 525
211116 782080 509
160607 839867 525
469156 524872 470
179513 603971 470
256146 516519 470
407370 844444 525
492930 557545 470
90903 724236 509
173328 758938 509
479977 990802 525
156686 895445 525
467272 961842 525
315006 996290 525
71094 608323 470
477970 624194 470
31073 707765 509
403979 692166 509
58937 875927 525
213416 742422 509
490711 989332 525
267611 900090 525
330284 779325 509
467752 938333 525
14519 659272 509
195905 995763 525
160946 855552 525
389641 630187 509
328648 706600 509
138113 900643 525
312259 619618 470
23761 846289 525
337871 931112 525
35010 899131 525
317224 767552 509
151608 811054 509
267042 936667 525
222366 614778 470
212461 692896 509
51215 743670 509
363900 750385 509
237827 526359 470
116062 630644 509
153062 947447 525
348464 795083 509
344450 664225 509
423607 884986 525
20404 778257 509
312300 573086 470
174637 647255 509
336542 843057 525
470162 621639 470
278166 693569 509
233612 507777 449
382644 801587 509
250309 750693 509
48298 990881 525
287739 682025 509
131953 957713 525
125419 982884 525
264677 989622 525
157489 691614 509
370782 681740 509
466113 702767 509
266009 659318 509
361661 619580 470
499696 832446 509
238837 782102 509
24348 989694 525
301191 924539 525
289978 553385 470
186237 855312 525
55986 976400 525
35337 689908 509
431127 678869 509
184706 698970 509
179680 844018 525
400439 567216 470
36438 884570 525
266246 804700 509
40003 632063 509
421348 558322 470
476079 677558 509
350263 502584 449
165336 654420 509
423769 958536 525
219303 626472 509
309940 776187 509
100333 863245 525
463226 549045 470
38735 650948 509
259966 722664 509
6476 662714 509
301579 544841 470
43306 571922 470
345360 603231 470
212082 785879 509
172062 704667 509
459595 526094 470
204938 642750 509
190128 646433 509
112946 912433 525
271416 939251 525
184718 875778 525
300865 666776 509
435910 856670 525
328577 696954 509
90717 836805 509
356279 893331 525
377965 919011 525
476470 743245 509
31948 705411 509
39087 707911 509
409415 516679 470
242684 617331 470
156314 950690 525
275762 772773 509
374945 548727 470
208496 563805 470
435276 526582 470
240308 873444 525
381662 572420 470
67061 974645 525
420287 942124 525
364672 814987 509
371979 845289 525
54279 907494 525
62396 611473 470
124287 972837 525
124749 885583 525
86162 799638 509
332485 865991 525
83025 711457 509
425452 808553 509
283442 863339 525
333583 542015 470
248264 718388 509
125336 819240 509
203974 547776 470
271367 585127 470
360226 646617 509
426138 933053 525
63623 505233 449
40573 705690 509
476695 684737 509
87584 580298 470
495439 939605 525
457483 580904 470
160201 885124 525
386334 962497 525
260012 736650 509
16447 509364 449
451511 643063 509
339951 672188 509
187404 614085 470
256833 565660 470
271014 699790 509
494837 838929 525
204207 555300 470
55249 683095 509
249785 660008 509
260109 748528 509
95604 721741 509
340037 774793 509
116876 743004 509
248501 879445 525
478989 765919 509
385163 934694 525
406729 741528 509
118687 611880 470
352782 876256 525
174465 640432 509
74841 688313 509
491134 781071 509
253765 548097 470
459948 507765 444
205566 739618 509
265124 819777 509
470351 621898 470
106028 604398 470
364234 855977 525
480466 844558 525
119475 884710 525
290073 542938 470
123444 910251 525
153039 993910 525
284278 844417 525
132723 862556 525
