*** Life<Cell> 14x15 ***

Generation = 0, Population = 91.
0--0----0---00-
000-00-00--0-0-
00000-00----0-0
--0-0-0-00-0---
--00------000--
---0-------0000
--0----0-0000--
---0-0-0-0---0-
-000--000000--0
------0------00
-0--0-0-0-00-00
---0--000-000-0
--0--0-00-0---0
-0-----0--000-0

Generation = 1, Population = 98.
1----0--10--1-0
11---10--00--1-
-1--10--00-0-0-
0---1-1011010-0
-0----0-0-1---0
--010--0-001--1
-0-0-001---1-00
-001--0-0-0----
01--0--1-1-1001
--0000---0--0-1
0-0----01---0-1
-0-----11-1110-
----0-01---0-0-
0----001-0--1-1

Generation = 2, Population = 106.
*---01-0*--0-0-
--0--*10011--*-
0*00--0--1-101-
-0-0*0---*1*101
---0-01-1--000-
-01*1-01011-0--
01--011--00*-1-
-1----1--0-00--
1-001---0*0*1--
----110--10--0-
-01-000---0--0*
----0--*--***--
00-0-0-*-0-1-1-
-0---11---0--0-

Generation = 3, Population = 92.
.0001-0-.----10
--1--.*11**0-*0
1.1--01-----1*-
-101.-1--*-.--*
-------0*01----
---.--1-1*--10-
1*----*--11.--0
0*-1--*0---1---
-11----11.1.---
00--**-0--1--1-
01*-11--------*
0-0-10-*1-...00
1---010*---*0*0
-1000-*-----111

Generation = 4, Population = 115.
.11-*-1-*0001--
1---0..--**10.-
-.--11*-0-0-*.0
-*1*.-*--*-.1-.
-000--11.-*0000
00-.-0*1-.11*1-
-*00-1*---**0--
-.0-00*--00-0-0
1**-10-*****-0-
-100**-1-1*00--
1**-**0-1-0--0*
-01-*10**0...-1
*---1*1.--0*1.1
-*---1*------*-

Generation = 5, Population = 93.
.**-.---*111-1-
--10-.*-1..*1.0
1*1---*---11*.-
0**..-.--*1.--*
-11-0-*-*-.1-11
111.1-.-1**-.--
-.110*.---..1-0
0.-1--.---1-10-
*..0*10*....---
0*--..0*--.1111
*..0..--*-1--1*
0---.--.*1..*--
*000-.*.0-1**.*
-.0---*1--00-*-

Generation = 6, Population = 87.
.**-.-10*---1--
11*10..-*...-.-
-.*--1.00--**.-
-....-.--*-.1-*
0**-1-.-*0.--*-
***.--.1-**-*1-
-.-*1*.-01*.*1-
1*--0-.0-0---1-
*.*-*-1*....--1
1*0-..-.--.*-*-
*..-..0-*0--0-*
--1-.-0.**..*--
*-111.*.10-....
0.1--1**-0--1*-

Generation = 7, Population = 97.
*..-.1*-*1-1-1-
**.-1*.1.*.*-.-
1.*---.1--1***0
0.**.0.01*1**0.
-.*--0.-.1.-0.-
*...-0.--..-.*1
-.-****11-...*0
-*----.101---*-
..*-.-***...-0-
*.-0.*-.01..1*1
*.*-..1-*-1-11.
-0*-.1-...*..01
.-*-*...-11.**.
1.*--***0100*.1

Generation = 8, Population = 87.
**.-*-*0*--*--0
*..1**.*.*..-.0
-.*-1-.--1-...1
1.***1.--.*..-*
-.*-1-.1.*.-1.1
...*--.11..-*.-
1.1.**.*--..*.-
1.-100.*-*1-1*-
.**-.-*.....---
..0-.*0.1*.*-.*
*.*-**--*0*--*.
-1*0.--...*..1*
.-*-*..*--*....
-*.0-***-*1-*.-

Generation = 9, Population = 104.
**.-*1*1*-1.111
*.**...*.**.-*-
-.*--1*10*-..*-
-.*..*.0-**..0*
0**-*-**.*.1*.*
.**.10.**..1*.1
**-..*.*-1..*.-
*.0*1-.*-.*--*0
.**-.1.....*101
..-0*.-.-...1..
...0**-0*1.-1*.
-*.1.1-.*.**.-*
.0.-**.*1-*..*.
1.*-0***-*--..-

Generation = 10, Population = 80.
***-*-***1*****
*.**......**-.-
1.*-1-.--.1.**-
1.*.*..-1..*.-*
1..-*-...*.-..*
....--...*.-..*
*.1..*.*1-*.*.-
*.-**0..0.*-1.-
.*.0.-.....**1-
..--..-.1...-.*
...1.*-1***--*.
0..*.-0...**.1*
*1.-....-1**...
-*.--..*0*--..-

Generation = 11, Population = 100.
*.*0.-.**-..**.
*...**.**...1.0
-.*0*1.-0**.**-
-...**.0-****-*
**.0.0..***1.**
.*..10...**-.*.
.*-*.***-1*..*0
*.-*.-**1.*1-.-
..*1.1...*.***-
..--*.-**.**1.*
...**.1**.*-1*.
1**.*--*.....-*
*-*1...*--.**..
-*.--...-*-0..-

Generation = 12, Population = 67.
.*.1*1***1..**.
.....*......-.-
1..-.*.1-.....1
1*.....--....-*
***-.-.....-..*
.*.**1.*...-...
**-*....1-..**1
.*-*.0..*..--.0
..*-.-.......*-
..00..-.....*.*
.**.*.*...*0-.*
-...*1-......-.
*-.*....11***..
-**0-...0.-1*.-

Generation = 13, Population = 73.
...*******.....
............1*0
**.-..*-0.....*
*.*....0-....0*
...-*0.....-...
...***.....-..*
**-*.****1...*-
**0**-.....-1.1
.*.1*1.......*1
..11..0....**.*
.**.*......1-*.
1**.**-.....*-.
.-.*....--*.*..
-**-0...1.--*.-

Generation = 14, Population = 66.
....*****....*.
....*....*..**-
**.-...1-...*..
*....**--....1*
...-.-*....-.**
..**...**..-...
*.1...****...*1
..-..0.**..1-.*
*..*.*.....*..*
..--..-....*..*
*...*......*-*.
*...**0.....*-.
*-...*..11..**.
1.*0-...-.11..-

Generation = 15, Population = 88.
....*****...**.
....*.......**0
**.-.**-0...*.*
**...**--...*-*
...0.-*....-.**
.***.....*.-...
.***.....*...*-
.*0.*1...***1.*
....*.*...*****
..-1*.-...**.**
....*......*1*.
**..*.1....*.1.
*1.*.**.***.**.
**.10...1****.-

Generation = 16, Population = 73.
....****....*.*
....*...*..*..-
**.-*.*--..**.*
***.*..01...*1*
*..1*-*....-.**
.*..*......-.**
*.......**.***-
.*-.**...*..-.*
..*............
..1**.0........
....*.......-..
*****.**.*...-*
.*.*..*.*....*.
**.-1*.*-...**-

Generation = 17, Population = 71.
....****.......
...**......*..-
*.*0*..--..*..*
..*.*.*1*..*.*.
*..**-.*...-...
**.***.....1...
**..**..***.*.1
.*-.....***.1*.
.**............
..-.**-........
......**....-..
**..*.***....-.
........*...***
***-****-...**1

Generation = 18, Population = 56.
...****........
..*...*.......0
.**1...10.**...
..*...***...*..
*....-.**..-*..
......*.***-...
...*.*..*...*.-
..-.....*.*.-*.
.**......*.....
..1..*-........
....*...*...-..
.....**.*....1.
..***...*...*.*
.*.-.***-...*.-

Generation = 19, Population = 48.
...****........
.*....*.......-
.*.*...--*.*...
..**..*.....*..
.....-.....1...
......*....1...
........*.**..-
..0.....*...-..
.**......*.....
.***..0........
....*.**....-..
.....*..**...-.
..***...*...*..
..*1****-....*1

*** Life<Cell> 19x3 ***

Generation = 0, Population = 48.
0--
000
---
000
000
-00
000
000
0-0
000
00-
000
000
00-
000
000
000
000
000

Generation = 1, Population = 30.
1-0
--1
---
-1-
--1
011
--1
111
---
11-
110
1--
1--
110
1--
1-1
1-1
1-1
-1-

Generation = 2, Population = 26.
--1
00*
-00
0--
00*
1-*
-0-
*--
--0
---
**1
--0
--0
*-1
---
--*
---
*0*
---

Generation = 3, Population = 29.
1-*
11.
0--
11-
1-*
*-*
0--
.-1
00-
11-
.*-
1--
10-
.-*
1--
-0.
10-
.-.
010

Generation = 4, Population = 29.
*0.
**.
-0-
**-
-0*
*-.
10-
*--
---
-*0
.*1
*0-
-1-
*-.
--0
11.
*-1
.-*
1-1

Generation = 5, Population = 32.
*-.
..*
0-0
*.-
1-*
*1*
*11
*--
000
1*-
..-
*1-
1*0
.-.
---
-**
*0*
.0*
--*

Generation = 6, Population = 21.
.0.
...
1-1
*.-
-0*
.*.
.*-
.1-
111
-.-
..-
*--
-.1
.1.
-00
-.*
*-.
*-.
--*

*** Life<Cell> 6x13 ***

Generation = 0, Population = 56.
000000000-0--
0-000--0-00-0
-0-0-0000-000
000---00-0000
000-00-000000
00-0-000-0-00

Generation = 1, Population = 41.
--111--110100
1----00--1101
01-1011-1-111
----00-1----1
1--01--1--1-1
--0-0---010--

Generation = 2, Population = 40.
00*-*--*-1*1-
*-0-0---0---*
-*-*1--0-0-**
-0-01-0*-----
-0-1*-0*--*-*
00-010--1--00

Generation = 3, Population = 41.
--*-.00.1***-
*-10-0-0-110*
-*0.*1-11--**
0--1*--.0000-
---*.0-.-0.0*
1---*1---1-1-

Generation = 4, Population = 34.
00*-*-1**...-
.0*10-01--*-.
0.-..----01..
----.0-*-1-11
--0*.10.--.1*
-0--*-0-1*-*-

Generation = 5, Population = 32.
11.1*--.*...-
.-.-------*0.
-*0**11-1--..
0-01*10.-*0--
--1*.--.0-.*.
1---*11-*.-*-

Generation = 6, Population = 28.
**.*.0-.....-
*-.--00--1.1.
-*1..*-----*.
-01-.*-.0*1--
-0-..--.1-.*.
-00-*-*-..0.0

Generation = 7, Population = 37.
**..*1-.....-
*0.101110-**.
-.-.**--1--*.
01-1..0.-**1-
1-1*.10**-.*.
1-1-.-.0..-*-

Generation = 8, Population = 37.
****.--*....-
*-**------**.
-.-...1-*-1.*
-*1*..1.0*.*1
-0-***1.*-.**
*-*-.1.1*.0.0

Generation = 9, Population = 32.
*..*.-1.....-
*0.*0-1101**.
0.-...*-*0*.*
0*-*..-.1...*
-1-...-..-...
.0*-.*.***-.1

Generation = 10, Population = 37.
*****1*.***.-
*1**1-*-1*.*.
-.-****1.1..*
-*-...1**..*.
---...-*.0...
.-*0....*.0.-

Generation = 11, Population = 25.
*....-*.*.*.-
**..*-.1-..*.
0.-....-.*.**
0.1.*.-..**..
-11...-..-*..
.0.1....**-.-

Generation = 12, Population = 26.
**...1.*....-
**...1.--*.**
-.1*...1**.**
1.**..-..*...
---...-.*0*..
.1.-.....*-.-

Generation = 13, Population = 29.
**...**.....0
*...**.--*.**
-.-**..*.*.**
-***..-*...*.
111...-.*-*..
.-.-....**-.-

*** Life<Cell> 20x6 ***

Generation = 0, Population = 60.
-----0
--0-0-
-00000
000---
--0--0
0-0-0-
-0----
000--0
-0-00-
--0000
-0-00-
0-0--0
00--00
-0-00-
00-000
-000--
-000-0
-0--00
0--0--
--0-0-

Generation = 3, Population = 65.
0-*--1
---0*-
----*1
*1*--0
1-1--0
00-0--
-*-0*-
*-.-10
0.1-1*
1-.---
-1-0--
-101*1
00000-
-01-1-
1.*.*1
-.--1-
*1100*
0*-*.-
10-10-
-*0-1*

Generation = 6, Population = 47.
10.---
-0--.-
--0-.-
.-.*-1
*-.0*1
1--.--
-.*1.-
.1.-.-
0*1--*
.-**-*
-.-1-0
1.--.*
.-11.0
*0*-*-
*.....
1.-*-0
..-.1*
*.-.**
-----0
****1.

Generation = 9, Population = 50.
.-.--1
--*-*1
11--.*
*1..-.
.*.1.-
*0-.*.
-...*1
*****0
..--1.
.0..-*
-.0.-0
1*1*..
*-*...
*-.-.0
.*....
....1.
..1*1.
.**...
-1**-*
.***.*

Generation = 12, Population = 31.
.0.00.
-*.*.*
*---.*
*...-.
.*.*.*
.-....
-....*
.****0
...-*.
.0*.1.
-**.-1
1.-...
.-....
.-*-.-
......
......
..-.-.
*.*...
....-.
*.*...

Generation = 15, Population = 30.
.**--.
-..**.
.-10**
...**.
*...*.
*0**..
1*...*
.*...1
...1..
.1*.**
0..*--
*.-...
.0....
.-.-.-
......
......
..-.-.
......
....-.
......

*** Life<Cell> 19x13 ***

Generation = 0, Population = 98.
-0---0---00-0
000-00-0-0---
-0-0--00----0
0-0-----0----
0-00---00----
-00--0-000-00
--0---0---0--
0-0--0---0-00
-0-0-0-0-----
-0--0--000--0
---0-0----0--
--00-0------0
-00---0----0-
0000000--0---
0-0-----00-0-
---000------0
---00--0000--
-00000000-0--
0---0---0----

Generation = 3, Population = 125.
0---0.*-*--10
.-*0.----*-10
--------000-0
.-*---*-*01--
---*--*1-1--*
--1-*0*0.*0--
-11--*-0*0001
--11-*-0--*-.
-**--*-*-1---
----0*-1-1--1
--110-*0*0-*-
0-1--11-1-*00
-0.00*1--0--0
0*-0111-11-10
---*---0*--00
*---1**011-01
0-01.0--.-1-*
1*-.11-*1-*00
00-1-001-*---

Generation = 6, Population = 103.
-1---.*1*-.*-
.-...1**-****
--1*--.-00001
.-.--**-.01--
1--*--.*--*-.
11.-.*.*..-**
-..1-.--..--*
1***-.0-1-.1.
-..-1*-*1.-10
---0-.0--**-1
*.-*11..*--.-
-*.-0-.0.-.*0
-*.-1..-**1--
-.1-..1*---**
-.**----.0--.
*-0-.*..*.-1*
01***010.1.1.
.*-.*.-***.01
---**0---.1--

Generation = 9, Population = 112.
-**--.**.-..-
*-*....*0....
*1.**-.111-1-
.-.00*.0.1.1-
.11.-1*..1*0*
-**-*.*.*.-.*
*.**0*--*.--.
**..-*10*-..*
*..-*.-.-.-11
**---.-1-..0.
.*******.-1.0
0..---.-.-...
*..0*..-**.*-
-*.-...***1*.
*.**1**0*-.-.
*-1*......1-.
-.*.***-..*1.
..0*..-*.*.-*
0-0**10.-****

Generation = 12, Population = 97.
-**-1..**-..-
.*.*..*.1....
..*..-*..1-..
*-*-.*...1.1-
.-1..***.-.**
-..-..**..-..
**.**..-..0-*
**..*.1-.-...
.*****-*-.***
..---*1.-.*1*
.**.....**1.-
...0--**.-*..
..*-..**.*.*-
..**......***
*.*.*.*..1.**
*****....*.**
0..*..*-*.***
..-**.-*...-*
-0-*.1..-....

Generation = 15, Population = 71.
-*.1-**..-..-
*...**.......
....*-*...-..
.0.-***.....1
.1..*......*.
-.....*...-*.
...**.*1.*0-.
.**...*-.*...
.*....1*-.*..
..*.1...*.*.*
.*...*..*.*.*
.*.0*....***.
*..**.....*.-
*...*........
...**........
.....**......
...*...-..*..
.....*1.*.*-.
010***..-....
